{"text_format":"1","workbook":"xlsx","n_sheets":15,"sheets":["Bedienungshinweise","Gesamt-Einnahmen und Ausgaben","Übersicht Banken u. Kassen","Bankkonto-Wehr","Kasse-Wehr","Bankkonto-Jugendwehr","Kasse-Jugendwehr","Bankkonto-Musikzug","Kasse-Musikzug","Kasse 4","Kasse 5","Gesamt-Planung","Gesamtrechnung (Plan-Ist)","Bestandsverzeichnis","Checkliste Kassenprüfung"],"not_rendered":{"charts":0,"images":4,"macros":1,"external_links":0,"defined_names":10,"comments":11,"pivot_tables":0},"unopened":[],"bounds":{"document_bytes":16777216,"sheet_cells":100000,"rows_first":2000,"rows_last":500,"rows_between":2000,"halvings":0,"cell_chars":16384,"cell_head_chars":4096},"cells_cut":0,"cells_raw":0,"read":"whole","date_system":"1900"}

{"sheet":"Bedienungshinweise","index":0,"n_rows":43,"n_cols":2,"rows_kept":43,"cut":false,"hidden":false,"merged":[[37,0,41,0]]}
[null,"Bedienungshinweise zum Haushaltsprogramm"]
[1,"Das Haushaltsprogramm Kameradschaftskassen Feuerwehren stellt eine vom LFV ehrenamtlich erstellte Arbeitshilfe in Excel für die Feuerwehren im Land Schleswig-Holstein dar. Rechtsgrundlage ist insbesondere §2a BrSchG S-H. Eine Verpflichtung zur Nutzung besteht nicht, der erforderliche Zweck der durch Gesetz und Satzung vorgeschriebenen Verfahrensweisen und Darstellungen des Sondervermögens Kameradschaftskasse kann auch mit anderen Mitteln erreicht werden, sofern die Darstellung den in den Reitern \"Gesamt-Einnahmen und Ausgaben\", \"Gesamtplanung 2021\" und \"Gesamtrechnung (Plan-Ist 2020\" ersichtlichen Mustern weitgehend entspricht. Das Programm erhebt keinen Anspruch auf Vollständigkeit, sondern kann beliebig individuell angepasst werden. Für die Bedienung sind einfache Excel-Kenntnisse erforderlich. Je nach Aktualität der Excel-Version können dargestellte Befehle textlich abweichen. Die alternative Nutzung mit einem \"Open-Office-Programm\" wie \"Libre Office\" oder \"OpenOffice\" ist möglich, wurde aber nicht getestet."]
[2,"Der Landesfeuerwehrverband Schleswig-Holstein übernimmt keine Garantie für Fehlerfreiheit. Das Programm wurde nach bestem Wissen entwickelt und getestet. Jedem Anwender wird empfohlen, das Programm für seine Zwecke ebenfalls zu testen sowie regelmäßig  Sicherungskopien anzufertigen. Bei jeder Veränderung besteht das Risiko, dass Formeln beschädigt oder gelöscht werden, was zu Fehlern im Programm führen kann. Um solche Fehler zu vermeiden, kann ein Blattschutz aktiviert werden (siehe unten). Jeder Anwender ist für die Ergebnisse dieser Anwendung selbst verantwortlich. Weitere Einzelheiten gehen aus der Satzung der Gemeinde/Stadt und Handlungshilfe für die Führung der Kameradschaftskassen der Freiwilligen Feuerwehren in Schleswig-Holstein hervor. Handlungshilfe und eine Fortbildung sind auf der Homepage des LFV-SH:  https://www.lfv-sh.de/fileadmin/download/wissenswertes/Handlungshilfe_Kameradschaftskassen_20170921Version3_0.pdf und  https://www.lfv-sh.de/fileadmin/download/wissenswertes/Fortbildung-Kameradschaftskassen_1_0.pdf veröffentlicht."]
[3,"Der Einnahme- und Ausgabeplan wird von der Mitgliederversammlung beschlossen und tritt nach der Zustimmung der Gemeindevertretung/Stadtvertretung in Kraft. Zur Ausführung des Einnahme- und Ausgabeplans kann die Gemeindewehrführung oder die Ortswehrführung Erklärungen abgeben und Handlungen ausführen, durch welche die Gemeinde verpflichtet, berechtigt oder befreit werden kann; er oder sie handelt insoweit in Vertretung der Bürgermeisterin oder des Bürgermeisters. Wird eine Veranstaltung nach Maßgabe des Einnahme- und Ausgabeplans über das Sondervermögen abgewickelt, ist die Gemeinde Veranstalter."]
[4,"Das Programm eignet sich für viele Größen von Feuerwehren. Bei einer kleinen Feuerwehr mit einem Bankkonto und einer Kasse ist die Idee, nur die Arbeitsblätter \"Bankkonto-Wehr\" sowie \"Kasse-Wehr\" genutzt werden, bei größeren Feuerwehren die bis zu 6 weiteren Arbeitsblätter. Zur individuellen Anpassung können die Arbeitsblätter in eine andere Reihenfolge verschoben werden, etwa wenn es nur 1 Bankkonto, aber 4 Kassen gibt. [ auf den Reiter laufen_ mit linker Maustaste festhalten_ nach rechts oder links laufen]. Bankkonto-Reiter lassen sich natürlich auch als Kassen-Reiter (und umgedreht) nutzen. Die Übersicht in Reiter \"Übersicht Banken und Kassen\" und die Bezeichnung des Arbeitsblattes muss dann entsprechend angepasst werden. Bei Auslieferung sind in allen Buchungsbereichen Buchungen zur Demonstration und Orientierung enthalten. Vor dem Start müssen alle Kennziffern und Beträge gelöscht werden."]
[5,"Bei Investitionen im Einzelbetrag ab 500,00 Euro ist ein Bestandsverzeichnis zu führen. Es sollte dem Muster im Reiter \"Bestandsverzeichnis\" entsprechen. Bei Vortrag des Programms auf das Folgejahr (siehe weiter unten) darf das Bestandsverzeichnis nicht gelöscht werden."]
[6,"In verschiedenen Zellen des Programms sind erläuternde Hinweise in Form von Kommentaren angebracht. Der Kommentar wird durch Herauflaufen auf die Zelle und auf die oben rechts in der jeweiligen Zelle erkennbare rote Ecke aktiviert. Eine dauerhafte Anzeige/Verbergen einzelner Kommentare erfolgt über [rechte Maustaste_Kommentare ein-/ausblenden]."]
[7,"Im Auslieferungszustand sind die Kommentare weitgehend zugeklappt. Sie können alle in einem Zuge wie folgt aufgeklappt/zugeklappt werden: [Im Menue: Überprüfen_Alle Kommentare anzeigen; Alle Zuklappen: erneut auf \"Alle Kommentare anzeigen\" clicken]. Um Beschädigungen an Verweisen und Formeln zu vermeiden, wurde an vielen Stellen ein Blattschutz ohne Passwort für schützenswerte Zellen eingearbeitet, der für jedes einzelne Blatt jederzeit im Menue \"Überprüfen\"_\"Blatt schützen\" bzw \"Blattschutz aufheben\" aktiviert oder aufgehoben werden kann. Bei \"Blatt schützen\" muss ein Haken bei (mindestens)  \"Nicht gesperrte Zellen auswählen\" gesetzt sein. Im Auslieferungszustand ist der Blattschutz nicht bei allen Arbeitsblättern aktiviert."]
[8,"Jedes Blatt hat für Buchungen 150 Zeilen. Weitere je 50 Zeilen können mit der Schaltfläche \"Weitere 50 Zeilen einfügen\" erzeugt werden. Vorher den Blattschutz ausschalten, falls aktiviert. Der Jahresbedarf an Zeilen sollte zu Jahresbeginn erzeugt werden. Die zusätzlichen Zeilen werden vor der Zeile 51 eingesetzt. Sofern der Buchungsstoff bereits darüber hinausgeht, wird eine Lücke erzeugt, die anschließend durch Hochsetzen des Buchungsstoffs (Kopie, nicht Schieben!) zu bereinigen ist. Fehlergefahr !"]
[9,"Es wird empfohlen, unterjährig regelmäßige Sicherungskopien zu erzeugen z.B. monatlich oder jedes viertel Jahr. Im Reiter \"Übersicht Banken u. Kassen\" sind Eingabezellen in leichtem Grün gefärbt."]
[10,"Vorgehen bei Planung und Buchung des aktuellen Jahres:"]
[11,"a) Eingabe der Planzahlen für das aktuelle Jahr (2021) Erstanwendung: Im Reiter \"Bankkonto-Wehr\" die geplanten Beträge für Einnahmen (Spalte K 5 bis 11) und Ausgaben (Spalte L 5 bis 11) gemäß der Bezeichnungen Nr. 0 bis 14 im gelben Feld oben rechts eintragen. Alle Plan-Einnahmen und Plan-Ausgaben bis zum Jahresende müssen geschätzt werden. Es empfiehlt sich eine Rundung auf volle Einhundert Euro. Es sollte darauf geachtet werden, in den jeweiligen Positionen ausreichend Reserven mit aufzunehmen. Vorgehen Folgejahr siehe unten."]
[12,"b) Eingabe der Konto- und Kassenstände am 1. Januar des aktuellen Jahres (z.B. 2021) im Reiter \"Übersicht Banken u. Kassen\" Spalte D."]
[13,"c) Individuelle Auswahl der Anzahl Bankkonten und Kassen. Ggf. Verschieben der Reiter wie oben beschrieben."]
[14,"d) Buchung der angefallenen Geschäftsvorgänge in den Feldern ab Zeile 20 der jeweiligen Arbeitsblätter. Einsetzen der jeweiligen Ziffern in Spalte \"F\". Bei einer Umbuchung zwischen Konten und Kassen bitte Kennziffer \"U\" verwenden. Bitte auf richtige Kennziffer und richtige Spalte achten, hohe Fehlergefahr."]
[15,"e) Gegen Jahresende zur Vorbereitung der Planung des nächsten Jahres gesamtes Programm mit neuer Jahreszahl (z.B. 2022) abspeichern. In der laufenden Datei (2021) die Arbeiten wie gewohnt bis zum Jahresende fortsetzen."]
[16,"f) Nach Buchung des letzten Geschäftsvofalls des laufenden Geschäftsjahres und Abstimmung mit den Kontoauszügen der Banken bzw. Kassenaufnahmen zum 31. Dezember ergibt sich im Reiter \"Gesamtrechnung (Plan-Ist 2021)\" der Soll-Ist-Vergleich, der ausgedruckt der Bürgermeisterin/dem Bürgermeister zur Kenntnisnahme durch die Gemeindevertretung/Stadtvertretung zuzuleiten ist. Der Soll-Ist-Vergleich kann den Bericht der Kassenführung auf der Jahreshauptversammlung ergänzen."]
[17,"Eingebaute Prüfungen sowie Dokumentation der Kassenprüfung"]
[18,"In das Haushaltsprogramm wurden verschiedene Prüfungen aufgenommen. "]
[19,"A) Reiter \"Übersicht Banken u. Kassen\""]
[20,"A1) Zelle F14: Prüfung, ob errechneter Stand Sondervermögen in Zelle F13 mit aktuellem Stand Sondervermögen Zelle D18 in Reiter \"Gesamt-Einnahmen und Ausgaben\" übereinstimmt. Anzeige: \"OK\""]
[21,"A2) Zelle G17: Prüfung, ob alle Umbuchungen zwischen Konten und Kassen  ausgeglichen sind. Anzeige \"OK\""]
[22,"A3) Spalte H, Zellen 3 bis 5 und 7 bis 11: Erste Prüfung, ob in der jeweiligen Zeile der errechnete Stand gem. Buchführung (Spalte F) negativ ist. Anzeige von: \"FEHLER! Aktueller Stand gem. Buchführung darf nicht negativ werden\"."]
[23,"A4) Spalte H, Zellen 3 bis 5 und 7 bis 11: Zweite Prüfung, ob in der jeweiligen Zeile der errechnete Stand gem. Buchführung (Spalte F) dem Stand gem. Kontoauszug bzw. Kassenaufnahmeprotokoll (Spalte G) entspricht.   Anzeige von: \"Aktueller Stand gem. Buchführung stimmt mit Stand am 31. Dezember überein\"  oder  \"FEHLER! Aktueller Stand gem. Buchführung stimmt nicht mit Stand am 31. Dezember überein\". Es wird empfohlen, die Abstimmung mit dem Konten- und Kassenbeständen auch unterjährig regelmäßig durchzuführen, z.B. jedes Quartal."]
[24,"B) Alle Reiter \"Bankkonto xy\" sowie \"Kasse xy\":"]
[25,"B1) Zelle J17: Prüfung,  ob in der jeweiligen Zeile J16 der errechnete Betrag gem. Buchführung (Spalte F) negativ ist. Anzeige von: \"FEHLER! Aktueller Stand gem. Buchführung darf nicht negativ werden\" bzw \"OK\". Bei einem negativen Betrag in der jeweiligen Zelle J16 färbt sich der Hintergrund rot."]
[26,"B2) Zelle G174 (oder nach Einfügung weiterer neuer Zeilen Zelle G225 bzw. G274 usw.):  Prüfung, ob die Einnahmen mit Kennziffern für Einnahmen versehen sind und ob die Summe der Einnahmen richtig in die obere Darstellung der Einnahmen übernommen wurden. Anzeige von \"OK\" oder \"Fehler\"."]
[27,"B3) Zelle HI174 (oder nach Einfügung neuer Zeilen Zelle HI225 bzw. HI274 usw.): Prüfung, ob die Ausgaben mit Kennziffern für Ausgaben versehen sind und ob die Summe der Ausgaben richtig in die obere Darstellung der Ausgaben übernommen wurden."]
[28,"Zur Dokumentation der Kassenprüfung und dessen Ergebnis ist in der \"Übersicht Banken u. Kassen ein Formblatt mit Ausdruckbereich eingerichtet. Anzeige über \"Seitenansicht\"."]
[29,"Vorgehen bei Aufstellung der Planansätze des Folgejahres (Bearbeitung in 2021 für 2022) und Vorbereiten für die Buchungen des Folgejahres"]
[30,"a) Zur Aufstellung der Planansätze des Folgejahres in der neu erzeugten Datei des Folgejahres (2021) werden im Reiter \"Bankkonto-Wehr\" die geplanten Beträge für Einnahmen (Spalte K 5 bis 11) und Ausgaben (Spalte L 5 bis 11) gemäß der Bezeichnungen Nr. 0 bis 14 im gelben Feld oben rechts eintragen. Als Orientierung dienen die bis dahin aufgelaufenen Ist-Einnahmen und Ist-Ausgaben des bereits weitgehend abgelaufenen Haushaltsvorjahres (2020). Weitere noch zu erwartende Ist-Einnahmen und Ist-Ausgaben bis zum Jahresende müssen, wie auch bereits bekannte zusätzliche/geringere Einnahmen und Ausgaben, für die Planung geschätzt werden. Es empfiehlt sich eine Aufrundung mindestens auf volle Einhundert Euro. Dieser Planungsprozeß anhand der Orientierung an den Ist-Zahlen des Haushaltsvorjahres sollte in allen Arbeitsblättern mit Bankkonten und Kassen durchgeführt werden. Je später im Jahr die Planungsarbeit erfolgt, um so vollständiger sind die Ist-Zahlen und somit die Genauigkeit der zu planenden neuen Werte. Sofern die Planung erst Anfang Januar des Folgejahres durchgeführt wird, ist beim Anfangsbestand zum 1.1. (Reiter \"Gesamt-Planung 202x; Zelle C 17) der Endstand zum 31.12. des abgelaufenen Haushaltsjahres (Reiter \"Übersicht Banken u. Kassen; Zelle F 13 der Vorjahresdatei) exakt zu übernehmen."]
[31,"b) Sind alle Planzahlen eingegeben, ergibt sich die neue Planung des Folgejahres (2022) aus dem (alten) Reiter Gesamt-Planung 2021, durch Doppelclick auf den Text des Reiters anpassbar auf Gesamt-Planung 2022."]
[32,"c) Die Planung des Folgejahres kann nun ausgedruckt und von der Hauptversammlung beschlossen werden. "]
[33,"d) Anschließend ist die Planung der Bürgermeisterin/dem Bürgermeister zur Zustimmung durch die Gemeindevertretung/Stadtvertretung zuzuleiten."]
[34,"e) Zur Vorbereitung des Programms auf das nächste Geschäftsjahr sind die Bank- und Kassenstände vom 31.Dezember des abgelaufenen Geschäftsjahres im Reiter \"Übersicht Banken u. Kassen\" in Spalte D \"Stand am 1. Januar\" einzutragen und anschließend alle Buchungen des Vorjahrs in den Arbeitsblättern zu löschen. Das Bestandsverzeichnis darf nicht gelöscht werden. Es muss alle Investitionen der Vorjahre bis zum Abgang einzelner Vermögensgegenstände enthalten. Eine Inventur zum Jahresende wird empfohlen."]
[35,"f) Zusammenfassend sind (nur) die folgenden Unterlagen an die Gemeinde/Stadt zu geben: 1) Gesamt-Planung des Folgejahres zum Beschluss; 2) Gesamtrechnung (Soll-Ist-Vergleich) des abgelaufenen Jahres zur Kenntnis. Weitere Untergliederungen, z.B. durch die einzelnen Arbeitsblätter, sind interne Unterlagen der Feuerwehr. Die Buchungsunterlagen werden bei der Gemeinde/Stadt archiviert."]
[36,"Ein Tipp bei der Fehlersuche: Lässt sich die Abweichung glatt durch 9 teilen, handelt es sich mit an Sicherheit grenzender Wahrscheinlichkeit um einen Zahlendreher bei der Eingabe eines Wertes, z.B. in der laufenden Buchhaltung."]
[37,"Versionsinfo:"]
[null,"2.0: 31.Oktober 2020"]
[null,"2.1: 07.Januar 2021: Behebt ein Problem bei der Buchung der Rücklage, sofern die Summe der Einnahmen gleich der Summe der Ausgaben ist."]
[null,"2.2: 25.Januar 2021: Berechnung der Rücklagenbewegung angepasst"]
[null,"2.3: 2.März 2022: Darstellungsproblem einer Prüfzelle behoben; Checkliste Kassenprüfung eingefügt"]
[null,"© Ludwig Fink; Landesfeuerwehrverband Schleswig-Holstein"]

{"sheet":"Gesamt-Einnahmen und Ausgaben","index":1,"n_rows":65,"n_cols":8,"rows_kept":65,"cut":false,"hidden":false,"merged":[[0,0,0,5],[1,0,1,2]]}
["Sondervermögen Kameradschaftskasse der Freiwilligen Feuerwehr der Gemeinde Musterort"]
["Einnahmen- und Ausgaben für das Haushaltsjahr ",null,null,2022]
["Nr.","Bezeichnung","Einnahmen ","Erläuterungen","Nr.","Bezeichnung","Ausgaben ","Erläuterungen"]
[1,2,3,4,5,6,7,8]
[0,"Zuwendungen von Mitgliedern",{"$f":"'Bankkonto-Wehr'!D5+'Kasse-Wehr'!D5+'Bankkonto-Jugendwehr'!D5+'Kasse-Jugendwehr'!D5+'Bankkonto-Musikzug'!D5+'Kasse-Musikzug'!D5+'Kasse 4'!D5+'Kasse 5'!D5","v":60016},null,8,"Ausgaben für Kameradschaftspflege und Versammlungen",{"$f":"'Bankkonto-Wehr'!H5+'Kasse-Wehr'!H5+'Bankkonto-Jugendwehr'!H5+'Kasse-Jugendwehr'!H5+'Bankkonto-Musikzug'!H5+'Kasse-Musikzug'!H5+'Kasse 4'!H5+'Kasse 5'!H5","v":60121}]
[1,"Zuwendungen von Dritten",{"$f":"'Bankkonto-Wehr'!D6+'Kasse-Wehr'!D6+'Bankkonto-Jugendwehr'!D6+'Kasse-Jugendwehr'!D6+'Bankkonto-Musikzug'!D6+'Kasse-Musikzug'!D6+'Kasse 4'!D6+'Kasse 5'!D6","v":60014},null,9,"Ausgaben für Ehrungen, Geschenke und ähnliche Anlässe",{"$f":"'Bankkonto-Wehr'!H6+'Kasse-Wehr'!H6+'Bankkonto-Jugendwehr'!H6+'Kasse-Jugendwehr'!H6+'Bankkonto-Musikzug'!H6+'Kasse-Musikzug'!H6+'Kasse 4'!H6+'Kasse 5'!H6","v":60014}]
[2,"Einnahmen aus Veranstaltungen ",{"$f":"'Bankkonto-Wehr'!D7+'Kasse-Wehr'!D7+'Bankkonto-Jugendwehr'!D7+'Kasse-Jugendwehr'!D7+'Bankkonto-Musikzug'!D7+'Kasse-Musikzug'!D7+'Kasse 4'!D7+'Kasse 5'!D7","v":60014},null,10,"Ausgaben für Veranstaltungen ",{"$f":"'Bankkonto-Wehr'!H7+'Kasse-Wehr'!H7+'Bankkonto-Jugendwehr'!H7+'Kasse-Jugendwehr'!H7+'Bankkonto-Musikzug'!H7+'Kasse-Musikzug'!H7+'Kasse 4'!H7+'Kasse 5'!H7","v":60007}]
[3,"Veräußerung von Vermögens-gegenständen im Einzelwert ab 500 € ",{"$f":"'Bankkonto-Wehr'!D8+'Kasse-Wehr'!D8+'Bankkonto-Jugendwehr'!D8+'Kasse-Jugendwehr'!D8+'Bankkonto-Musikzug'!D8+'Kasse-Musikzug'!D8+'Kasse 4'!D8+'Kasse 5'!D8","v":60014},"Einnahmen aus Abgängen von der Bestandsliste",11,"Erwerb von Vermögensgegenständen im Einzelwert ab 500 € ",{"$f":"'Bankkonto-Wehr'!H8+'Kasse-Wehr'!H8+'Bankkonto-Jugendwehr'!H8+'Kasse-Jugendwehr'!H8+'Bankkonto-Musikzug'!H8+'Kasse-Musikzug'!H8+'Kasse 4'!H8+'Kasse 5'!H8","v":60007},"Ausgaben für Zugänge zur Bestandsliste"]
[4,"Erstattung von Auslagen durch Gemeinde und Dritte",{"$f":"'Bankkonto-Wehr'!D9+'Kasse-Wehr'!D9+'Bankkonto-Jugendwehr'!D9+'Kasse-Jugendwehr'!D9+'Bankkonto-Musikzug'!D9+'Kasse-Musikzug'!D9+'Kasse 4'!D9+'Kasse 5'!D9","v":60014},null,12,"Auslagen für Gemeinde und Dritte",{"$f":"'Bankkonto-Wehr'!H9+'Kasse-Wehr'!H9+'Bankkonto-Jugendwehr'!H9+'Kasse-Jugendwehr'!H9+'Bankkonto-Musikzug'!H9+'Kasse-Musikzug'!H9+'Kasse 4'!H9+'Kasse 5'!H9","v":60007}]
[5,"Sonstige Einnahmen",{"$f":"'Bankkonto-Wehr'!D10+'Kasse-Wehr'!D10+'Bankkonto-Jugendwehr'!D10+'Kasse-Jugendwehr'!D10+'Bankkonto-Musikzug'!D10+'Kasse-Musikzug'!D10+'Kasse 4'!D10+'Kasse 5'!D10","v":60014},null,13,"Sonstige Ausgaben",{"$f":"'Bankkonto-Wehr'!H10+'Kasse-Wehr'!H10+'Bankkonto-Jugendwehr'!H10+'Kasse-Jugendwehr'!H10+'Bankkonto-Musikzug'!H10+'Kasse-Musikzug'!H10+'Kasse 4'!H10+'Kasse 5'!H10","v":60007}]
[6,"Einzahlungen der Gemeinde",{"$f":"'Bankkonto-Wehr'!D11+'Kasse-Wehr'!D11+'Bankkonto-Jugendwehr'!D11+'Kasse-Jugendwehr'!D11+'Bankkonto-Musikzug'!D11+'Kasse-Musikzug'!D11+'Kasse 4'!D11+'Kasse 5'!D11","v":60014},null,14,"Auszahlungen an die Gemeinde",{"$f":"'Bankkonto-Wehr'!H11+'Kasse-Wehr'!H11+'Bankkonto-Jugendwehr'!H11+'Kasse-Jugendwehr'!H11+'Bankkonto-Musikzug'!H11+'Kasse-Musikzug'!H11+'Kasse 4'!H11+'Kasse 5'!H11","v":60007}]
[7,"Entnahme aus der Rücklage",{"$f":"IF(C65<0,C65*-1,0)","v":70},"Automatische Buchung",15,"Zuführung zur Rücklage",{"$f":"IF(C65>0,C65,0)","v":0},"Automatische Buchung"]
[" 0-7","Gesamteinnahmen",{"$f":"SUM(C5:C12)","v":420170},null," 8-15","Gesamtausgaben",{"$f":"SUM(G5:G12)","v":420170}]
[null,"© Ludwig Fink; Landesfeuerwehrverband Schleswig-Holstein",null,null,null,"Die Ausgaben werden für gegenseitig deckungsfähig erklärt."]
[null,"Stand des Sondervermögens am 1.Januar 2021",{"$f":"'Übersicht Banken u. Kassen'!D13","v":307}]
[null,"Entnahme",{"$f":"C12","v":70}]
[null,"Zuführung",{"$f":"G12","v":0}]
[null,"Stand des Sondervermögens am 31.Dezember 2021",{"$f":"ROUNDDOWN((C15-C16+C17),2)","v":237},{"$f":"IF(C18>=0,\" \",\"FEHLER! Stand negativ\")","v":" "}]
[]
[]
[]
[]
[]
[]
[]
[]
[]
[]
[]
[]
[]
[]
[]
[]
[]
[]
[]
[]
[]
[]
[]
[]
[]
[]
[]
[]
[]
[]
[]
[]
[]
[]
[]
[]
[]
[]
[]
[]
[]
[]
[]
[]
[]
[null,"Rechenzellen:"]
[null,"Rücklage",{"$f":"'Bankkonto-Wehr'!H12-'Bankkonto-Wehr'!D12+'Kasse-Wehr'!H12-'Kasse-Wehr'!D12+'Bankkonto-Jugendwehr'!H12-'Bankkonto-Jugendwehr'!D12+'Kasse-Jugendwehr'!H12-'Kasse-Jugendwehr'!D12+'Bankkonto-Musikzug'!H12-'Bankkonto-Musikzug'!D12+'Kasse-Musikzug'!H12-'Kasse-Musikzug'!D12+'Kasse 4'!H12-'Kasse 4'!D12+'Kasse 5'!H12-'Kasse 5'!D12","v":-70}]

{"sheet":"Übersicht Banken u. Kassen","index":2,"n_rows":33,"n_cols":7,"rows_kept":33,"cut":false,"hidden":false,"merged":[[22,4,22,5],[24,6,25,6],[26,6,26,7],[23,2,23,3],[24,2,25,3],[23,4,23,5],[24,4,25,5],[26,2,26,3],[26,4,26,5],[16,0,16,2],[5,0,5,2],[6,0,6,2],[7,0,7,2],[8,0,8,2],[9,0,9,2],[10,0,10,2],[11,0,11,2],[12,0,12,2]]}
[]
[{"$f":"'Gesamt-Einnahmen und Ausgaben'!D2","v":2022},null,"Konto","Stand am 1. Januar gemäß Kontoauszug/ Kassenaufnahmeprotokoll","Aktueller Stand gemäß Buchführung","Stand am 31. Dezember        gemäß Kontoauszug/ Kassenaufnahme-protokoll","Kommentare für Kassenwartung und die Kassenprüfung"]
["Bank Wehr","VR-Bank Kalifornien ","DE 35 213500 08 000183 223",1,{"$f":"ROUND('Bankkonto-Wehr'!I17,2)","v":202},202,{"$f":"IF(E3<0,\"FEHLER! Aktueller Stand gem. Buchführung darf nicht negativ werden\",IF(F3=0,\"\",IF(E3-F3=0,\"Aktueller Stand gem. Buchführung stimmt mit Stand am 31. Dezember überein\",\"FEHLER! Aktueller Stand gem. Buchführung stimmt nicht mit Stand am 31. Dezember überein\")))","v":"Aktueller Stand gem. Buchführung stimmt mit Stand am 31. Dezember überein"}]
["Bank Jugendwehr","VR-Bank Kalifornien ","DE 35 213500 08 001183 223",1,{"$f":"ROUND('Bankkonto-Jugendwehr'!I17,2)","v":1},1,{"$f":"IF(E4<0,\"FEHLER! Aktueller Stand gem. Buchführung darf nicht negativ werden\",IF(F4=0,\"\",IF(E4-F4=0,\"Aktueller Stand gem. Buchführung stimmt mit Stand am 31. Dezember überein\",\"FEHLER! Aktueller Stand gem. Buchführung stimmt nicht mit Stand am 31. Dezember überein\")))","v":"Aktueller Stand gem. Buchführung stimmt mit Stand am 31. Dezember überein"}]
["Bank Musikzug","Sparkasse Brasilien","DE 76 205700 02 003366 454",1,{"$f":"ROUND('Bankkonto-Musikzug'!I17,2)","v":8},8,{"$f":"IF(E5<0,\"FEHLER! Aktueller Stand gem. Buchführung darf nicht negativ werden\",IF(F5=0,\"\",IF(E5-F5=0,\"Aktueller Stand gem. Buchführung stimmt mit Stand am 31. Dezember überein\",\"FEHLER! Aktueller Stand gem. Buchführung stimmt nicht mit Stand am 31. Dezember überein\")))","v":"Aktueller Stand gem. Buchführung stimmt mit Stand am 31. Dezember überein"}]
["Summe Bankkonten",null,null,{"$f":"SUM(D3:D5)","v":3},{"$f":"SUM(E3:E5)","v":211},{"$f":"SUM(F3:F5)","v":211}]
["Kasse Wehr",null,null,300,{"$f":"ROUND('Kasse-Wehr'!I17,2)","v":1},1,{"$f":"IF(E7<0,\"FEHLER! Aktueller Stand gem. Buchführung darf nicht negativ werden\",IF(F7=0,\"\",IF(E7-F7=0,\"Aktueller Stand gem. Buchführung stimmt mit Stand am 31. Dezember überein\",\"FEHLER! Aktueller Stand gem. Buchführung stimmt nicht mit Stand am 31. Dezember überein\")))","v":"Aktueller Stand gem. Buchführung stimmt mit Stand am 31. Dezember überein"}]
["Kasse Jugendwehr",null,null,1,{"$f":"ROUND('Kasse-Jugendwehr'!I17,2)","v":8},8,"Aktueller Stand gem. Buchführung stimmt mit Stand am 31. Dezember überein"]
["Kasse Musikzug",null,null,1,{"$f":"ROUND('Kasse-Musikzug'!I17,2)","v":8},8,"Aktueller Stand gem. Buchführung stimmt mit Stand am 31. Dezember überein"]
["Kasse 4",null,null,1,{"$f":"ROUND('Kasse 4'!I17,2)","v":8},8,"Aktueller Stand gem. Buchführung stimmt mit Stand am 31. Dezember überein"]
["Kasse 5",null,null,1,{"$f":"ROUND('Kasse 5'!I17,2)","v":1},1,{"$f":"IF(E11<0,\"FEHLER! Aktueller Stand gem. Buchführung darf nicht negativ werden\",IF(F11=0,\"\",IF(E11-F11=0,\"Aktueller Stand gem. Buchführung stimmt mit Stand am 31. Dezember überein\",\"FEHLER! Aktueller Stand gem. Buchführung stimmt nicht mit Stand am 31. Dezember überein\")))","v":"Aktueller Stand gem. Buchführung stimmt mit Stand am 31. Dezember überein"}]
["Summe Kassen",null,null,{"$f":"SUM(D7:D11)","v":304},{"$f":"SUM(E7:E11)","v":26},{"$f":"SUM(F7:F11)","v":26}]
["Stand des Sondervermögens",null,null,{"$f":"D6+D12","v":307},{"$f":"ROUNDDOWN((E6+E12),2)","v":237},{"$f":"F6+F12","v":237}]
["© Ludwig Fink; Landesfeuerwehrverband Schleswig-Holstein",null,null,null,{"$f":"IF('Gesamt-Einnahmen und Ausgaben'!C18='Übersicht Banken u. Kassen'!E13,\"OK\",\"Fehler\")","v":"OK"}]
[]
[]
["Prüfung: Umbuchungen zwischen Konten und Kassen sind ausgeglichen:",null,null,{"$f":"ROUNDDOWN(('Bankkonto-Wehr'!D15+'Kasse-Wehr'!D15+'Bankkonto-Jugendwehr'!D15+'Kasse-Jugendwehr'!D15+'Bankkonto-Musikzug'!D15+'Kasse-Musikzug'!D15+'Kasse 4'!D15+'Kasse 5'!D15),2)","v":6200},{"$f":"ROUNDDOWN(('Bankkonto-Wehr'!H15+'Kasse-Wehr'!H15+'Bankkonto-Jugendwehr'!H15+'Kasse-Jugendwehr'!H15+'Bankkonto-Musikzug'!H15+'Kasse-Musikzug'!H15+'Kasse 4'!H15+'Kasse 5'!H15),2)","v":6200},{"$f":"IF(D17=E17,\"OK\",\"Fehler\")","v":"OK"}]
[]
[]
[]
[]
[null,null,null,null,null,null,"Ergebnis der Kassenprüfung:  Mit - Ohne Beanstandungen  (Nichtzutreffendes streichen)"]
[null,null,null,null,"Datum:",null,"Kassenprüfung Datum:"]
[null,null,null,null,"Aufgestellt von:  Name Kassenführung",null,"Geprüft von:    Name Kassenprüfer/-in 1                       Name Kassenprüfer/in 2"]
[null,null,null,null,"Unterschrift Kassenführung"]
[]
[null,null,null,null,"                                Unterschrift",null,"                                Unterschrift                                                             Unterschrift"]
[]
[]
[]
[]
[]
[null,null,null,null,null,"Sprung zu:","Bedienungshinweise!A1"]

{"sheet":"Bankkonto-Wehr","index":3,"n_rows":174,"n_cols":12,"rows_kept":174,"cut":false,"hidden":false,"merged":[[1,10,1,11],[168,2,168,4],[169,2,169,4],[162,2,162,4],[163,2,163,4],[164,2,164,4],[165,2,165,4],[166,2,166,4],[167,2,167,4],[156,2,156,4],[157,2,157,4],[158,2,158,4],[159,2,159,4],[160,2,160,4],[161,2,161,4],[150,2,150,4],[151,2,151,4],[152,2,152,4],[153,2,153,4],[154,2,154,4],[155,2,155,4],[144,2,144,4],[145,2,145,4],[146,2,146,4],[147,2,147,4],[148,2,148,4],[149,2,149,4],[138,2,138,4],[139,2,139,4],[140,2,140,4],[141,2,141,4],[142,2,142,4],[143,2,143,4],[132,2,132,4],[133,2,133,4],[134,2,134,4],[135,2,135,4],[136,2,136,4],[137,2,137,4],[126,2,126,4],[127,2,127,4],[128,2,128,4],[129,2,129,4],[130,2,130,4],[131,2,131,4],[120,2,120,4],[121,2,121,4],[122,2,122,4],[123,2,123,4],[124,2,124,4],[125,2,125,4],[64,2,64,4],[65,2,65,4],[119,2,119,4],[72,2,72,4],[116,2,116,4],[66,2,66,4],[67,2,67,4],[68,2,68,4],[76,2,76,4],[80,2,80,4],[84,2,84,4],[88,2,88,4],[92,2,92,4],[96,2,96,4],[100,2,100,4],[104,2,104,4],[108,2,108,4],[115,2,115,4],[58,2,58,4],[59,2,59,4],[60,2,60,4],[61,2,61,4],[62,2,62,4],[63,2,63,4],[52,2,52,4],[53,2,53,4],[54,2,54,4],[55,2,55,4],[56,2,56,4],[57,2,57,4],[46,2,46,4],[47,2,47,4],[48,2,48,4],[49,2,49,4],[50,2,50,4],[51,2,51,4],[18,2,18,4],[19,2,19,4],[20,2,20,4],[21,2,21,4],[28,2,28,4],[29,2,29,4],[30,2,30,4],[31,2,31,4],[32,2,32,4],[22,2,22,4],[23,2,23,4],[24,2,24,4],[25,2,25,4],[26,2,26,4],[27,2,27,4],[42,2,42,4],[43,2,43,4],[44,2,44,4],[36,7,36,8],[37,7,37,8],[38,7,38,8],[39,7,39,8],[40,7,40,8],[33,2,33,4],[45,2,45,4],[40,2,40,4],[41,2,41,4],[34,2,34,4],[35,2,35,4],[36,2,36,4],[37,2,37,4],[38,2,38,4],[39,2,39,4],[41,7,41,8],[42,7,42,8],[43,7,43,8],[44,7,44,8],[45,7,45,8],[27,7,27,8],[28,7,28,8],[29,7,29,8],[30,7,30,8],[31,7,31,8],[32,7,32,8],[33,7,33,8],[34,7,34,8],[35,7,35,8],[18,7,18,8],[19,7,19,8],[20,7,20,8],[21,7,21,8],[22,7,22,8],[23,7,23,8],[24,7,24,8],[25,7,25,8],[26,7,26,8],[46,7,46,8],[47,7,47,8],[48,7,48,8],[49,7,49,8],[50,7,50,8],[51,7,51,8],[52,7,52,8],[53,7,53,8],[54,7,54,8],[131,7,131,8],[133,7,133,8],[132,7,132,8],[64,7,64,8],[65,7,65,8],[72,7,72,8],[55,7,55,8],[56,7,56,8],[57,7,57,8],[58,7,58,8],[59,7,59,8],[60,7,60,8],[61,7,61,8],[62,7,62,8],[63,7,63,8],[122,7,122,8],[121,7,121,8],[116,7,116,8],[66,7,66,8],[67,7,67,8],[68,7,68,8],[76,7,76,8],[80,7,80,8],[84,7,84,8],[18,9,18,11],[19,9,19,11],[20,9,20,11],[21,9,21,11],[22,9,22,11],[23,9,23,11],[24,9,24,11],[25,9,25,11],[169,7,169,8],[134,7,134,8],[135,7,135,8],[136,7,136,8],[137,7,137,8],[138,7,138,8],[139,7,139,8],[140,7,140,8],[123,7,123,8],[124,7,124,8],[125,7,125,8],[126,7,126,8],[127,7,127,8],[128,7,128,8],[129,7,129,8],[130,7,130,8],[26,9,26,11],[27,9,27,11],[28,9,28,11],[29,9,29,11],[30,9,30,11],[31,9,31,11],[32,9,32,11],[33,9,33,11],[34,9,34,11],[35,9,35,11],[36,9,36,11],[37,9,37,11],[38,9,38,11],[39,9,39,11],[40,9,40,11],[41,9,41,11],[42,9,42,11],[43,9,43,11],[44,9,44,11],[45,9,45,11],[46,9,46,11],[47,9,47,11],[48,9,48,11],[49,9,49,11],[50,9,50,11],[51,9,51,11],[52,9,52,11],[62,9,62,11],[63,9,63,11],[64,9,64,11],[65,9,65,11],[72,9,72,11],[53,9,53,11],[54,9,54,11],[55,9,55,11],[56,9,56,11],[57,9,57,11],[58,9,58,11],[59,9,59,11],[60,9,60,11],[61,9,61,11],[66,9,66,11],[67,9,67,11],[68,9,68,11],[118,9,118,11],[0,3,0,4],[0,5,0,6],[173,7,173,8],[172,7,172,8],[174,5,174,8],[15,7,15,8],[1,1,1,3],[141,9,141,11],[142,9,142,11],[143,9,143,11],[144,9,144,11],[145,9,145,11],[146,9,146,11],[147,9,147,11],[130,9,130,11],[131,9,131,11],[132,9,132,11],[133,9,133,11],[134,9,134,11],[135,9,135,11],[136,9,136,11],[137,9,137,11],[138,9,138,11],[168,9,168,11],[168,7,168,8],[167,9,167,11],[167,7,167,8],[166,9,166,11],[166,7,166,8],[165,9,165,11],[165,7,165,8],[164,9,164,11],[164,7,164,8],[163,9,163,11],[163,7,163,8],[162,9,162,11],[162,7,162,8],[161,9,161,11],[161,7,161,8],[160,9,160,11],[160,7,160,8],[159,9,159,11],[159,7,159,8],[158,9,158,11],[158,7,158,8],[157,9,157,11],[157,7,157,8],[156,9,156,11],[156,7,156,8],[155,9,155,11],[155,7,155,8],[154,9,154,11],[154,7,154,8],[153,9,153,11],[153,7,153,8],[152,9,152,11],[152,7,152,8],[151,9,151,11],[151,7,151,8],[150,9,150,11],[150,7,150,8],[149,9,149,11],[149,7,149,8],[120,9,120,11],[120,7,120,8],[119,9,119,11],[119,7,119,8],[148,9,148,11],[148,7,148,8],[147,7,147,8],[146,7,146,8],[145,7,145,8],[144,7,144,8],[143,7,143,8],[142,7,142,8],[141,7,141,8],[140,9,140,11],[139,9,139,11],[121,9,121,11],[122,9,122,11],[123,9,123,11],[124,9,124,11],[125,9,125,11],[126,9,126,11],[127,9,127,11],[128,9,128,11],[129,9,129,11],[116,9,116,11],[117,2,117,4],[117,7,117,8],[117,9,117,11],[118,2,118,4],[118,7,118,8],[69,2,69,4],[69,7,69,8],[69,9,69,11],[70,2,70,4],[70,7,70,8],[70,9,70,11],[71,2,71,4],[71,7,71,8],[71,9,71,11],[73,2,73,4],[73,7,73,8],[73,9,73,11],[74,2,74,4],[74,7,74,8],[74,9,74,11],[75,2,75,4],[75,7,75,8],[75,9,75,11],[76,9,76,11],[77,2,77,4],[77,7,77,8],[77,9,77,11],[78,2,78,4],[78,7,78,8],[78,9,78,11],[79,2,79,4],[79,7,79,8],[79,9,79,11],[80,9,80,11],[81,2,81,4],[81,7,81,8],[81,9,81,11],[82,2,82,4],[82,7,82,8],[82,9,82,11],[83,2,83,4],[83,7,83,8],[83,9,83,11],[84,9,84,11],[85,2,85,4],[85,7,85,8],[85,9,85,11],[86,2,86,4],[86,7,86,8],[86,9,86,11],[87,2,87,4],[87,7,87,8],[87,9,87,11],[88,7,88,8],[88,9,88,11],[89,2,89,4],[89,7,89,8],[89,9,89,11],[90,2,90,4],[90,7,90,8],[90,9,90,11],[91,2,91,4],[91,7,91,8],[91,9,91,11],[92,7,92,8],[92,9,92,11],[93,2,93,4],[93,7,93,8],[93,9,93,11],[94,2,94,4],[94,7,94,8],[94,9,94,11],[95,2,95,4],[95,7,95,8],[95,9,95,11],[96,7,96,8],[96,9,96,11],[97,2,97,4],[97,7,97,8],[97,9,97,11],[98,2,98,4],[98,7,98,8],[98,9,98,11],[99,2,99,4],[99,7,99,8],[99,9,99,11],[100,7,100,8],[100,9,100,11],[101,2,101,4],[101,7,101,8],[101,9,101,11],[102,2,102,4],[102,7,102,8],[102,9,102,11],[103,2,103,4],[103,7,103,8],[103,9,103,11],[104,7,104,8],[104,9,104,11],[105,2,105,4],[105,7,105,8],[105,9,105,11],[106,2,106,4],[106,7,106,8],[106,9,106,11],[107,2,107,4],[107,7,107,8],[107,9,107,11],[108,7,108,8],[108,9,108,11],[109,2,109,4],[109,7,109,8],[109,9,109,11],[110,2,110,4],[110,7,110,8],[110,9,110,11],[111,2,111,4],[111,7,111,8],[111,9,111,11],[115,7,115,8],[115,9,115,11],[112,2,112,4],[112,7,112,8],[112,9,112,11],[113,2,113,4],[113,7,113,8],[113,9,113,11],[114,2,114,4],[114,7,114,8],[114,9,114,11]]}
[null,"Konto 1","Bankkonto Wehr",{"$f":"'Übersicht Banken u. Kassen'!B3","v":"VR-Bank Kalifornien "},null,{"$f":"'Übersicht Banken u. Kassen'!C3","v":"DE 35 213500 08 000183 223"}]
[null,{"$f":"'Gesamt-Einnahmen und Ausgaben'!A2","v":"Einnahmen- und Ausgaben für das Haushaltsjahr "},null,null,{"$f":"'Gesamt-Einnahmen und Ausgaben'!D2","v":2022},null,null,null,null,null,"Planung 2022"]
[null,{"$f":"'Gesamt-Einnahmen und Ausgaben'!A3","v":"Nr."},{"$f":"'Gesamt-Einnahmen und Ausgaben'!B3","v":"Bezeichnung"},{"$f":"'Gesamt-Einnahmen und Ausgaben'!C3","v":"Einnahmen "},{"$f":"'Gesamt-Einnahmen und Ausgaben'!D3","v":"Erläuterungen"},{"$f":"'Gesamt-Einnahmen und Ausgaben'!E3","v":"Nr."},{"$f":"'Gesamt-Einnahmen und Ausgaben'!F3","v":"Bezeichnung"},{"$f":"'Gesamt-Einnahmen und Ausgaben'!G3","v":"Ausgaben "},{"$f":"'Gesamt-Einnahmen und Ausgaben'!H3","v":"Erläuterungen"},null,"Einnahmen ","Ausgaben "]
[null,1,2,3,4,5,6,7,8]
[null,{"$f":"'Gesamt-Einnahmen und Ausgaben'!A5","v":0},{"$f":"'Gesamt-Einnahmen und Ausgaben'!B5","v":"Zuwendungen von Mitgliedern"},{"$f":"SUMIF(F$20:F$169,B5,G$20:G$169)","v":10003},null,{"$f":"'Gesamt-Einnahmen und Ausgaben'!E5","v":8},{"$f":"'Gesamt-Einnahmen und Ausgaben'!F5","v":"Ausgaben für Kameradschaftspflege und Versammlungen"},{"$f":"SUMIF(F$20:F$169,F5,H$20:H$169)","v":10008},null,null,1000,2000]
[null,{"$f":"'Gesamt-Einnahmen und Ausgaben'!A6","v":1},{"$f":"'Gesamt-Einnahmen und Ausgaben'!B6","v":"Zuwendungen von Dritten"},10002,null,{"$f":"'Gesamt-Einnahmen und Ausgaben'!E6","v":9},{"$f":"'Gesamt-Einnahmen und Ausgaben'!F6","v":"Ausgaben für Ehrungen, Geschenke und ähnliche Anlässe"},10001,null,null,1000,1000]
[null,{"$f":"'Gesamt-Einnahmen und Ausgaben'!A7","v":2},{"$f":"'Gesamt-Einnahmen und Ausgaben'!B7","v":"Einnahmen aus Veranstaltungen "},10002,null,{"$f":"'Gesamt-Einnahmen und Ausgaben'!E7","v":10},{"$f":"'Gesamt-Einnahmen und Ausgaben'!F7","v":"Ausgaben für Veranstaltungen "},10001,null,null,1000,1000]
[null,{"$f":"'Gesamt-Einnahmen und Ausgaben'!A8","v":3},{"$f":"'Gesamt-Einnahmen und Ausgaben'!B8","v":"Veräußerung von Vermögens-gegenständen im Einzelwert ab 500 € "},10002,{"$f":"'Gesamt-Einnahmen und Ausgaben'!D8","v":"Einnahmen aus Abgängen von der Bestandsliste"},{"$f":"'Gesamt-Einnahmen und Ausgaben'!E8","v":11},{"$f":"'Gesamt-Einnahmen und Ausgaben'!F8","v":"Erwerb von Vermögensgegenständen im Einzelwert ab 500 € "},10001,{"$f":"'Gesamt-Einnahmen und Ausgaben'!H8","v":"Ausgaben für Zugänge zur Bestandsliste"},null,1000,1000]
[null,{"$f":"'Gesamt-Einnahmen und Ausgaben'!A9","v":4},{"$f":"'Gesamt-Einnahmen und Ausgaben'!B9","v":"Erstattung von Auslagen durch Gemeinde und Dritte"},10002,null,{"$f":"'Gesamt-Einnahmen und Ausgaben'!E9","v":12},{"$f":"'Gesamt-Einnahmen und Ausgaben'!F9","v":"Auslagen für Gemeinde und Dritte"},10001,null,null,1000,1000]
[null,{"$f":"'Gesamt-Einnahmen und Ausgaben'!A10","v":5},{"$f":"'Gesamt-Einnahmen und Ausgaben'!B10","v":"Sonstige Einnahmen"},10002,null,{"$f":"'Gesamt-Einnahmen und Ausgaben'!E10","v":13},{"$f":"'Gesamt-Einnahmen und Ausgaben'!F10","v":"Sonstige Ausgaben"},10001,null,null,1000,1000]
[null,{"$f":"'Gesamt-Einnahmen und Ausgaben'!A11","v":6},{"$f":"'Gesamt-Einnahmen und Ausgaben'!B11","v":"Einzahlungen der Gemeinde"},10002,null,{"$f":"'Gesamt-Einnahmen und Ausgaben'!E11","v":14},{"$f":"'Gesamt-Einnahmen und Ausgaben'!F11","v":"Auszahlungen an die Gemeinde"},10001,null,null,1000,1000]
[null,{"$f":"'Gesamt-Einnahmen und Ausgaben'!A12","v":7},{"$f":"'Gesamt-Einnahmen und Ausgaben'!B12","v":"Entnahme aus der Rücklage"},{"$f":"IF((H5+H6+H7+H8+H9+H10+H11)>(D5+D6+D7+D8+D9+D10+D11),H5+H6+H7+H8+H9+H10+H11-D5-D6-D7-D8-D9-D10-D11,0)","v":0},"Automatische Buchung",{"$f":"'Gesamt-Einnahmen und Ausgaben'!E12","v":15},{"$f":"'Gesamt-Einnahmen und Ausgaben'!F12","v":"Zuführung zur Rücklage"},{"$f":"IF((H5+H6+H7+H8+H9+H10+H11)<(D5+D6+D7+D8+D9+D10+D11),D5+D6+D7+D8+D9+D10+D11-H5-H6-H7-H8-H9-H10-H11,0)","v":1},"Automatische Buchung"]
[null,{"$f":"'Gesamt-Einnahmen und Ausgaben'!A13","v":" 0-7"},{"$f":"'Gesamt-Einnahmen und Ausgaben'!B13","v":"Gesamteinnahmen"},{"$f":"SUM(D5:D12)","v":70015},null,{"$f":"'Gesamt-Einnahmen und Ausgaben'!E13","v":" 8-15"},{"$f":"'Gesamt-Einnahmen und Ausgaben'!F13","v":"Gesamtausgaben"},{"$f":"SUM(H5:H12)","v":70015}," ",null,{"$f":"SUM(K5:K12)","v":7000},{"$f":"SUM(L5:L12)","v":8000}]
[null,"© Ludwig Fink; Landesfeuerwehrverband Schleswig-Holstein",null,null,null,null,{"$f":"'Gesamt-Einnahmen und Ausgaben'!F14","v":"Die Ausgaben werden für gegenseitig deckungsfähig erklärt."}]
[null,"U","Umbuchungen zw. Konten und Kassen",{"$f":"SUMIF(F$20:F$169,B15,G$20:G$169)","v":1200},null,"U","Umbuchungen zw. Konten und Kassen",{"$f":"SUMIF(F$20:F$169,F15,H$20:H$169)","v":1000}]
["Zeilen:",{"$f":"A169","v":150},null,"Bitte Kommentar beachten",null,null,{"$f":"'Übersicht Banken u. Kassen'!D2","v":"Stand am 1. Januar gemäß Kontoauszug/ Kassenaufnahmeprotokoll"},{"$f":"'Übersicht Banken u. Kassen'!E2","v":"Aktueller Stand gemäß Buchführung"}]
[null,"Sprung zu:","Bedienungshinweise!A1",null,null,null,{"$f":"'Übersicht Banken u. Kassen'!D3","v":1},null,{"$f":"G17+G171","v":202},{"$f":"IF(I17<0,\"Fehler! Kann nicht negativ werden\",\"OK\")","v":"OK"}]
[]
["Beleg-Nr.","Datum","Bezeichnung",null,null,"Kennziffer","Einnahme/Einzahlung","Ausgabe/Auszahlung",null,"Bemerkungen"]
[1,null,null,null,null,0,10003]
[{"$f":"A20+1","v":2},null,"Bitte vor Gebrauch Kennziffern und Beträge löschen",null,null,1,10002]
[{"$f":"A21+1","v":3},null,null,null,null,2,10002]
[4,null,null,null,null,3,10002]
[5,null,null,null,null,4,10002]
[6,null,null,null,null,5,10002]
[7,null,null,null,null,6,10002]
[8,null,null,null,null,8,null,10001]
[9,null,null,null,null,9,null,10001]
[10,null,null,null,null,10,null,10001]
[11,null,null,null,null,11,null,10001]
[12,null,null,null,null,12,null,10001]
[13,null,null,null,null,13,null,10001]
[14,null,null,null,null,14,null,10001]
[15,null,null,null,null,"u",null,1000]
[16,null,null,null,null,"u",500]
[17,null,null,null,null,"u",500]
[18,null,null,null,null,8,null,7]
[19,null,null,null,null,"u",200]
[20]
[21]
[22]
[23]
[24]
[25]
[26]
[27]
[28]
[29]
[30]
[31]
[32]
[33]
[34]
[35]
[36]
[37]
[38]
[39]
[40]
[41]
[42]
[43]
[44]
[45]
[46]
[47]
[48]
[49]
[50]
[51]
[52]
[53]
[54]
[55]
[56]
[57]
[58]
[59]
[60]
[61]
[62]
[63]
[64]
[65]
[66]
[67]
[68]
[69]
[70]
[71]
[72]
[73]
[74]
[75]
[76]
[77]
[78]
[79]
[80]
[81]
[82]
[83]
[84]
[85]
[86]
[87]
[88]
[89]
[90]
[91]
[92]
[93]
[94]
[95]
[96]
[97]
[98]
[99]
[100]
[101]
[102]
[103]
[104]
[105]
[106]
[107]
[108]
[109]
[110]
[111]
[112]
[113]
[114]
[115]
[116]
[{"$f":"A135+1","v":117}]
[118]
[119]
[120]
[121]
[122]
[123]
[124]
[125]
[126]
[127]
[128]
[129]
[130]
[131]
[132]
[133]
[134]
[135]
[136]
[137]
[138]
[139]
[140]
[141]
[142]
[143]
[144]
[145]
[146]
[147]
[148]
[149]
[150]
[null,null,null,null,null,"Summe:",{"$f":"ROUND(SUM(G20:G169),2)","v":71215},{"$f":"ROUND(SUM(H20:H169),2)","v":71014}]
[null,null,null,null,null,"aktuelle Veränderung",{"$f":"G170-H170","v":201}]
[]
[null,null,null,null,null,"Kontrolle",{"$f":"ROUND(SUM(D5:D11)-G170+D15,2)","v":0},{"$f":"ROUND(SUM(H5:H11)-H170+H15,2)","v":0}]
[null,null,null,null,null,"muss Null ergeben",{"$f":"IF(G173=0,\"OK\",\"Fehler\")","v":"OK"},{"$f":"IF(H173=0,\"OK\",\"Fehler\")","v":"OK"}]

{"sheet":"Kasse-Wehr","index":4,"n_rows":174,"n_cols":12,"rows_kept":174,"cut":false,"hidden":false,"merged":[[22,7,22,8],[23,7,23,8],[24,7,24,8],[25,7,25,8],[26,7,26,8],[27,7,27,8],[1,10,1,11],[18,7,18,8],[19,7,19,8],[20,7,20,8],[21,7,21,8],[18,9,18,11],[19,9,19,11],[20,9,20,11],[21,9,21,11],[22,9,22,11],[23,9,23,11],[24,9,24,11],[25,9,25,11],[26,9,26,11],[27,9,27,11],[15,7,15,8],[34,7,34,8],[35,7,35,8],[36,7,36,8],[37,7,37,8],[38,7,38,8],[39,7,39,8],[28,7,28,8],[29,7,29,8],[30,7,30,8],[31,7,31,8],[32,7,32,8],[33,7,33,8],[46,7,46,8],[47,7,47,8],[48,7,48,8],[49,7,49,8],[50,7,50,8],[51,7,51,8],[40,7,40,8],[41,7,41,8],[42,7,42,8],[43,7,43,8],[44,7,44,8],[45,7,45,8],[58,7,58,8],[59,7,59,8],[60,7,60,8],[61,7,61,8],[62,7,62,8],[63,7,63,8],[52,7,52,8],[53,7,53,8],[54,7,54,8],[55,7,55,8],[56,7,56,8],[57,7,57,8],[120,7,120,8],[121,7,121,8],[122,7,122,8],[123,7,123,8],[124,7,124,8],[125,7,125,8],[64,7,64,8],[65,7,65,8],[66,7,66,8],[67,7,67,8],[68,7,68,8],[119,7,119,8],[69,7,69,8],[70,7,70,8],[71,7,71,8],[72,7,72,8],[73,7,73,8],[74,7,74,8],[75,7,75,8],[76,7,76,8],[77,7,77,8],[78,7,78,8],[79,7,79,8],[80,7,80,8],[132,7,132,8],[133,7,133,8],[134,7,134,8],[135,7,135,8],[136,7,136,8],[137,7,137,8],[126,7,126,8],[127,7,127,8],[128,7,128,8],[129,7,129,8],[130,7,130,8],[131,7,131,8],[144,7,144,8],[145,7,145,8],[146,7,146,8],[147,7,147,8],[148,7,148,8],[149,7,149,8],[138,7,138,8],[139,7,139,8],[140,7,140,8],[141,7,141,8],[142,7,142,8],[143,7,143,8],[156,7,156,8],[157,7,157,8],[158,7,158,8],[159,7,159,8],[160,7,160,8],[161,7,161,8],[150,7,150,8],[151,7,151,8],[152,7,152,8],[153,7,153,8],[154,7,154,8],[155,7,155,8],[18,2,18,4],[19,2,19,4],[20,2,20,4],[21,2,21,4],[22,2,22,4],[23,2,23,4],[24,2,24,4],[25,2,25,4],[26,2,26,4],[33,2,33,4],[34,2,34,4],[35,2,35,4],[36,2,36,4],[37,2,37,4],[38,2,38,4],[27,2,27,4],[28,2,28,4],[29,2,29,4],[30,2,30,4],[31,2,31,4],[32,2,32,4],[45,2,45,4],[46,2,46,4],[47,2,47,4],[48,2,48,4],[49,2,49,4],[50,2,50,4],[39,2,39,4],[40,2,40,4],[41,2,41,4],[42,2,42,4],[43,2,43,4],[44,2,44,4],[57,2,57,4],[58,2,58,4],[59,2,59,4],[60,2,60,4],[61,2,61,4],[62,2,62,4],[51,2,51,4],[52,2,52,4],[53,2,53,4],[54,2,54,4],[55,2,55,4],[56,2,56,4],[119,2,119,4],[120,2,120,4],[121,2,121,4],[122,2,122,4],[123,2,123,4],[124,2,124,4],[63,2,63,4],[64,2,64,4],[65,2,65,4],[66,2,66,4],[67,2,67,4],[68,2,68,4],[69,2,69,4],[70,2,70,4],[71,2,71,4],[72,2,72,4],[73,2,73,4],[74,2,74,4],[75,2,75,4],[76,2,76,4],[77,2,77,4],[78,2,78,4],[79,2,79,4],[80,2,80,4],[131,2,131,4],[132,2,132,4],[133,2,133,4],[134,2,134,4],[135,2,135,4],[136,2,136,4],[125,2,125,4],[126,2,126,4],[127,2,127,4],[128,2,128,4],[129,2,129,4],[130,2,130,4],[143,2,143,4],[144,2,144,4],[145,2,145,4],[146,2,146,4],[147,2,147,4],[148,2,148,4],[137,2,137,4],[138,2,138,4],[139,2,139,4],[140,2,140,4],[141,2,141,4],[142,2,142,4],[155,2,155,4],[156,2,156,4],[157,2,157,4],[158,2,158,4],[159,2,159,4],[160,2,160,4],[149,2,149,4],[150,2,150,4],[151,2,151,4],[152,2,152,4],[153,2,153,4],[154,2,154,4],[167,2,167,4],[168,2,168,4],[169,2,169,4],[169,7,169,8],[161,2,161,4],[162,2,162,4],[163,2,163,4],[164,2,164,4],[165,2,165,4],[166,2,166,4],[168,7,168,8],[162,7,162,8],[163,7,163,8],[164,7,164,8],[165,7,165,8],[166,7,166,8],[167,7,167,8],[28,9,28,11],[29,9,29,11],[30,9,30,11],[31,9,31,11],[32,9,32,11],[33,9,33,11],[34,9,34,11],[35,9,35,11],[36,9,36,11],[37,9,37,11],[38,9,38,11],[39,9,39,11],[40,9,40,11],[41,9,41,11],[42,9,42,11],[43,9,43,11],[44,9,44,11],[45,9,45,11],[46,9,46,11],[47,9,47,11],[48,9,48,11],[49,9,49,11],[50,9,50,11],[51,9,51,11],[52,9,52,11],[53,9,53,11],[54,9,54,11],[55,9,55,11],[56,9,56,11],[57,9,57,11],[58,9,58,11],[59,9,59,11],[60,9,60,11],[61,9,61,11],[62,9,62,11],[63,9,63,11],[64,9,64,11],[65,9,65,11],[66,9,66,11],[67,9,67,11],[68,9,68,11],[119,9,119,11],[120,9,120,11],[121,9,121,11],[122,9,122,11],[69,9,69,11],[70,9,70,11],[71,9,71,11],[72,9,72,11],[73,9,73,11],[74,9,74,11],[75,9,75,11],[76,9,76,11],[77,9,77,11],[78,9,78,11],[79,9,79,11],[80,9,80,11],[133,9,133,11],[134,9,134,11],[135,9,135,11],[136,9,136,11],[137,9,137,11],[138,9,138,11],[139,9,139,11],[140,9,140,11],[123,9,123,11],[124,9,124,11],[125,9,125,11],[126,9,126,11],[127,9,127,11],[128,9,128,11],[129,9,129,11],[130,9,130,11],[131,9,131,11],[1,1,1,3],[1,4,1,6],[168,9,168,11],[159,9,159,11],[160,9,160,11],[161,9,161,11],[162,9,162,11],[163,9,163,11],[164,9,164,11],[165,9,165,11],[166,9,166,11],[167,9,167,11],[150,9,150,11],[151,9,151,11],[152,9,152,11],[153,9,153,11],[154,9,154,11],[155,9,155,11],[156,9,156,11],[157,9,157,11],[158,9,158,11],[141,9,141,11],[142,9,142,11],[143,9,143,11],[81,2,81,4],[81,7,81,8],[81,9,81,11],[82,2,82,4],[82,7,82,8],[82,9,82,11],[83,2,83,4],[83,7,83,8],[83,9,83,11],[84,2,84,4],[84,7,84,8],[84,9,84,11],[85,2,85,4],[85,7,85,8],[85,9,85,11],[86,2,86,4],[86,7,86,8],[86,9,86,11],[87,2,87,4],[87,7,87,8],[87,9,87,11],[88,2,88,4],[88,7,88,8],[88,9,88,11],[89,2,89,4],[89,7,89,8],[89,9,89,11],[90,2,90,4],[90,7,90,8],[90,9,90,11],[91,2,91,4],[91,7,91,8],[91,9,91,11],[92,2,92,4],[92,7,92,8],[92,9,92,11],[93,2,93,4],[93,7,93,8],[93,9,93,11],[94,2,94,4],[94,7,94,8],[94,9,94,11],[95,2,95,4],[95,7,95,8],[95,9,95,11],[96,2,96,4],[96,7,96,8],[96,9,96,11],[97,2,97,4],[97,7,97,8],[97,9,97,11],[98,2,98,4],[98,7,98,8],[98,9,98,11],[99,2,99,4],[99,7,99,8],[99,9,99,11],[100,2,100,4],[100,7,100,8],[100,9,100,11],[101,2,101,4],[101,7,101,8],[101,9,101,11],[102,2,102,4],[102,7,102,8],[102,9,102,11],[103,2,103,4],[103,7,103,8],[103,9,103,11],[104,2,104,4],[104,7,104,8],[104,9,104,11],[105,2,105,4],[105,7,105,8],[105,9,105,11],[106,2,106,4],[106,7,106,8],[106,9,106,11],[107,2,107,4],[107,7,107,8],[107,9,107,11],[108,2,108,4],[108,7,108,8],[108,9,108,11],[109,2,109,4],[109,7,109,8],[109,9,109,11],[110,2,110,4],[110,7,110,8],[110,9,110,11],[111,2,111,4],[111,7,111,8],[111,9,111,11],[112,2,112,4],[112,7,112,8],[112,9,112,11],[113,2,113,4],[113,7,113,8],[113,9,113,11],[172,7,172,8],[173,7,173,8],[117,2,117,4],[117,7,117,8],[117,9,117,11],[118,2,118,4],[118,7,118,8],[118,9,118,11],[114,2,114,4],[114,7,114,8],[114,9,114,11],[115,2,115,4],[115,7,115,8],[115,9,115,11],[116,2,116,4],[116,7,116,8],[116,9,116,11],[144,9,144,11],[145,9,145,11],[146,9,146,11],[147,9,147,11],[148,9,148,11],[149,9,149,11],[132,9,132,11]]}
[null,"Kasse 1","Kasse Wehr"]
[null,{"$f":"'Gesamt-Einnahmen und Ausgaben'!A2","v":"Einnahmen- und Ausgaben für das Haushaltsjahr "},null,null,{"$f":"'Gesamt-Einnahmen und Ausgaben'!D2","v":2022},null,null,null,null,null,{"$f":"'Bankkonto-Wehr'!K2:L2","v":"Planung 2022"}]
[null,{"$f":"'Gesamt-Einnahmen und Ausgaben'!A3","v":"Nr."},{"$f":"'Gesamt-Einnahmen und Ausgaben'!B3","v":"Bezeichnung"},{"$f":"'Gesamt-Einnahmen und Ausgaben'!C3","v":"Einnahmen "},{"$f":"'Gesamt-Einnahmen und Ausgaben'!D3","v":"Erläuterungen"},{"$f":"'Gesamt-Einnahmen und Ausgaben'!E3","v":"Nr."},{"$f":"'Gesamt-Einnahmen und Ausgaben'!F3","v":"Bezeichnung"},{"$f":"'Gesamt-Einnahmen und Ausgaben'!G3","v":"Ausgaben "},{"$f":"'Gesamt-Einnahmen und Ausgaben'!H3","v":"Erläuterungen"},null,"Einnahmen ","Ausgaben "]
[null,1,2,3,4,5,6,7,8]
[null,{"$f":"'Gesamt-Einnahmen und Ausgaben'!A5","v":0},{"$f":"'Gesamt-Einnahmen und Ausgaben'!B5","v":"Zuwendungen von Mitgliedern"},{"$f":"SUMIF(F$20:F$169,B5,G$20:G$169)","v":1},null,{"$f":"'Gesamt-Einnahmen und Ausgaben'!E5","v":8},{"$f":"'Gesamt-Einnahmen und Ausgaben'!F5","v":"Ausgaben für Kameradschaftspflege und Versammlungen"},{"$f":"SUMIF(F$20:F$169,F5,H$20:H$169)","v":100},null,null,1000,2000]
[null,{"$f":"'Gesamt-Einnahmen und Ausgaben'!A6","v":1},{"$f":"'Gesamt-Einnahmen und Ausgaben'!B6","v":"Zuwendungen von Dritten"},0,null,{"$f":"'Gesamt-Einnahmen und Ausgaben'!E6","v":9},{"$f":"'Gesamt-Einnahmen und Ausgaben'!F6","v":"Ausgaben für Ehrungen, Geschenke und ähnliche Anlässe"},0,null,null,1000,1000]
[null,{"$f":"'Gesamt-Einnahmen und Ausgaben'!A7","v":2},{"$f":"'Gesamt-Einnahmen und Ausgaben'!B7","v":"Einnahmen aus Veranstaltungen "},0,null,{"$f":"'Gesamt-Einnahmen und Ausgaben'!E7","v":10},{"$f":"'Gesamt-Einnahmen und Ausgaben'!F7","v":"Ausgaben für Veranstaltungen "},0,null,null,1000,1000]
[null,{"$f":"'Gesamt-Einnahmen und Ausgaben'!A8","v":3},{"$f":"'Gesamt-Einnahmen und Ausgaben'!B8","v":"Veräußerung von Vermögens-gegenständen im Einzelwert ab 500 € "},0,{"$f":"'Gesamt-Einnahmen und Ausgaben'!D8","v":"Einnahmen aus Abgängen von der Bestandsliste"},{"$f":"'Gesamt-Einnahmen und Ausgaben'!E8","v":11},{"$f":"'Gesamt-Einnahmen und Ausgaben'!F8","v":"Erwerb von Vermögensgegenständen im Einzelwert ab 500 € "},0,{"$f":"'Gesamt-Einnahmen und Ausgaben'!H8","v":"Ausgaben für Zugänge zur Bestandsliste"},null,1000,1000]
[null,{"$f":"'Gesamt-Einnahmen und Ausgaben'!A9","v":4},{"$f":"'Gesamt-Einnahmen und Ausgaben'!B9","v":"Erstattung von Auslagen durch Gemeinde und Dritte"},0,null,{"$f":"'Gesamt-Einnahmen und Ausgaben'!E9","v":12},{"$f":"'Gesamt-Einnahmen und Ausgaben'!F9","v":"Auslagen für Gemeinde und Dritte"},0,null,null,1000,1000]
[null,{"$f":"'Gesamt-Einnahmen und Ausgaben'!A10","v":5},{"$f":"'Gesamt-Einnahmen und Ausgaben'!B10","v":"Sonstige Einnahmen"},0,null,{"$f":"'Gesamt-Einnahmen und Ausgaben'!E10","v":13},{"$f":"'Gesamt-Einnahmen und Ausgaben'!F10","v":"Sonstige Ausgaben"},0,null,null,1000,1000]
[null,{"$f":"'Gesamt-Einnahmen und Ausgaben'!A11","v":6},{"$f":"'Gesamt-Einnahmen und Ausgaben'!B11","v":"Einzahlungen der Gemeinde"},0,null,{"$f":"'Gesamt-Einnahmen und Ausgaben'!E11","v":14},{"$f":"'Gesamt-Einnahmen und Ausgaben'!F11","v":"Auszahlungen an die Gemeinde"},0,null,null,1000,1000]
[null,{"$f":"'Gesamt-Einnahmen und Ausgaben'!A12","v":7},{"$f":"'Gesamt-Einnahmen und Ausgaben'!B12","v":"Entnahme aus der Rücklage"},{"$f":"IF((H5+H6+H7+H8+H9+H10+H11)>(D5+D6+D7+D8+D9+D10+D11),H5+H6+H7+H8+H9+H10+H11-D5-D6-D7-D8-D9-D10-D11,0)","v":99},"Automatische Buchung",{"$f":"'Gesamt-Einnahmen und Ausgaben'!E12","v":15},{"$f":"'Gesamt-Einnahmen und Ausgaben'!F12","v":"Zuführung zur Rücklage"},{"$f":"IF((H5+H6+H7+H8+H9+H10+H11)<(D5+D6+D7+D8+D9+D10+D11),D5+D6+D7+D8+D9+D10+D11-H5-H6-H7-H8-H9-H10-H11,0)","v":0},"Automatische Buchung"]
[null,{"$f":"'Gesamt-Einnahmen und Ausgaben'!A13","v":" 0-7"},{"$f":"'Gesamt-Einnahmen und Ausgaben'!B13","v":"Gesamteinnahmen"},{"$f":"SUM(D5:D12)","v":100},null,{"$f":"'Gesamt-Einnahmen und Ausgaben'!E13","v":" 8-15"},{"$f":"'Gesamt-Einnahmen und Ausgaben'!F13","v":"Gesamtausgaben"},{"$f":"SUM(H5:H12)","v":100}," ",null,{"$f":"SUM(K5:K12)","v":7000},{"$f":"SUM(L5:L12)","v":8000}]
[null,"© Ludwig Fink; Landesfeuerwehrverband Schleswig-Holstein",null,null,null,null,{"$f":"'Gesamt-Einnahmen und Ausgaben'!F14","v":"Die Ausgaben werden für gegenseitig deckungsfähig erklärt."}]
[null,"U","Umbuchungen zw. Konten und Kassen",{"$f":"SUMIF(F$20:F$169,B15,G$20:G$169)","v":0},null,"U","Umbuchungen zw. Konten und Kassen",{"$f":"SUMIF(F$20:F$169,F15,H$20:H$169)","v":200}]
["Zeilen:",{"$f":"A169","v":150},null,"Bitte Kommentar beachten",null,null,{"$f":"'Übersicht Banken u. Kassen'!D2","v":"Stand am 1. Januar gemäß Kontoauszug/ Kassenaufnahmeprotokoll"},{"$f":"'Übersicht Banken u. Kassen'!E2","v":"Aktueller Stand gemäß Buchführung"}]
[null,"Sprung zu:","Bedienungshinweise!A1",null,null,null,{"$f":"'Übersicht Banken u. Kassen'!D7","v":300},null,{"$f":"G17+G171","v":1},{"$f":"IF(I17<0,\"Fehler! Kann nicht negativ werden\",\"OK\")","v":"OK"}]
[]
["Beleg-Nr.","Datum","Bezeichnung",null,null,"Kennziffer","Einnahme/Einzahlung","Ausgabe/Auszahlung",null,"Bemerkungen"]
[1,null,null,null,null,8,null,100]
[{"$f":"A20+1","v":2},null,"Bitte vor Gebrauch Kennziffern und Beträge löschen",null,null,0,1]
[{"$f":"A21+1","v":3},null,null,null,null,"u",null,200]
[4]
[5]
[6]
[7]
[8]
[9]
[10]
[11]
[12]
[13]
[14]
[15]
[16]
[17]
[18]
[19]
[20]
[21]
[22]
[23]
[24]
[25]
[26]
[27]
[28]
[29]
[30]
[31]
[32]
[33]
[34]
[35]
[36]
[37]
[38]
[39]
[40]
[41]
[42]
[43]
[44]
[45]
[46]
[47]
[48]
[49]
[50]
[51]
[52]
[53]
[54]
[55]
[56]
[57]
[58]
[59]
[60]
[61]
[62]
[63]
[64]
[65]
[66]
[67]
[68]
[69]
[70]
[71]
[72]
[73]
[74]
[75]
[76]
[77]
[78]
[79]
[80]
[81]
[82]
[83]
[84]
[85]
[86]
[87]
[88]
[89]
[90]
[91]
[92]
[93]
[94]
[95]
[96]
[97]
[98]
[99]
[100]
[101]
[102]
[103]
[104]
[105]
[106]
[107]
[108]
[109]
[110]
[111]
[112]
[113]
[114]
[115]
[116]
[{"$f":"A135+1","v":117}]
[118]
[119]
[120]
[121]
[122]
[123]
[124]
[125]
[126]
[127]
[128]
[129]
[130]
[131]
[132]
[133]
[134]
[135]
[136]
[137]
[138]
[139]
[140]
[141]
[142]
[143]
[144]
[145]
[146]
[147]
[148]
[149]
[150]
[null,null,null,null,null,"Summe:",{"$f":"ROUND(SUM(G20:G169),2)","v":1},{"$f":"ROUND(SUM(H20:H169),2)","v":300}]
[null,null,null,null,null,"aktuelle Veränderung",{"$f":"G170-H170","v":-299}]
[]
[null,null,null,null,null,"Kontrolle",{"$f":"ROUND(SUM(D5:D11)-G170+D15,2)","v":0},{"$f":"ROUND(SUM(H5:H11)-H170+H15,2)","v":0}]
[null,null,null,null,null,"muss Null ergeben",{"$f":"IF(G173=0,\"OK\",\"Fehler\")","v":"OK"},{"$f":"IF(H173=0,\"OK\",\"Fehler\")","v":"OK"}]

{"sheet":"Bankkonto-Jugendwehr","index":5,"n_rows":174,"n_cols":12,"rows_kept":174,"cut":false,"hidden":false,"merged":[[121,9,121,11],[120,9,120,11],[119,9,119,11],[119,2,119,4],[119,7,119,8],[120,2,120,4],[120,7,120,8],[121,2,121,4],[121,7,121,8],[1,10,1,11],[167,2,167,4],[167,7,167,8],[168,2,168,4],[168,7,168,8],[169,2,169,4],[169,7,169,8],[164,2,164,4],[164,7,164,8],[165,2,165,4],[165,7,165,8],[166,2,166,4],[166,7,166,8],[161,2,161,4],[161,7,161,8],[162,2,162,4],[162,7,162,8],[163,2,163,4],[163,7,163,8],[158,2,158,4],[158,7,158,8],[159,2,159,4],[159,7,159,8],[160,2,160,4],[160,7,160,8],[155,2,155,4],[155,7,155,8],[156,2,156,4],[156,7,156,8],[157,2,157,4],[157,7,157,8],[152,2,152,4],[152,7,152,8],[153,2,153,4],[153,7,153,8],[154,2,154,4],[154,7,154,8],[149,2,149,4],[149,7,149,8],[150,2,150,4],[150,7,150,8],[151,2,151,4],[151,7,151,8],[146,2,146,4],[146,7,146,8],[147,2,147,4],[147,7,147,8],[148,2,148,4],[148,7,148,8],[143,2,143,4],[143,7,143,8],[144,2,144,4],[144,7,144,8],[145,2,145,4],[145,7,145,8],[140,2,140,4],[140,7,140,8],[141,2,141,4],[141,7,141,8],[142,2,142,4],[142,7,142,8],[137,2,137,4],[137,7,137,8],[138,2,138,4],[138,7,138,8],[139,2,139,4],[139,7,139,8],[134,2,134,4],[134,7,134,8],[135,2,135,4],[135,7,135,8],[136,2,136,4],[136,7,136,8],[131,2,131,4],[131,7,131,8],[132,2,132,4],[132,7,132,8],[133,2,133,4],[133,7,133,8],[128,2,128,4],[128,7,128,8],[129,2,129,4],[129,7,129,8],[130,2,130,4],[130,7,130,8],[116,7,116,8],[117,2,117,4],[117,7,117,8],[125,2,125,4],[125,7,125,8],[126,2,126,4],[126,7,126,8],[127,2,127,4],[127,7,127,8],[122,2,122,4],[122,7,122,8],[123,2,123,4],[123,7,123,8],[124,2,124,4],[124,7,124,8],[63,2,63,4],[63,7,63,8],[64,2,64,4],[64,7,64,8],[65,2,65,4],[65,7,65,8],[66,2,66,4],[66,7,66,8],[70,2,70,4],[70,7,70,8],[60,2,60,4],[60,7,60,8],[61,2,61,4],[61,7,61,8],[62,2,62,4],[62,7,62,8],[57,2,57,4],[57,7,57,8],[58,2,58,4],[58,7,58,8],[59,2,59,4],[59,7,59,8],[54,2,54,4],[54,7,54,8],[55,2,55,4],[55,7,55,8],[56,2,56,4],[56,7,56,8],[51,2,51,4],[51,7,51,8],[52,2,52,4],[52,7,52,8],[53,2,53,4],[53,7,53,8],[48,2,48,4],[48,7,48,8],[49,2,49,4],[49,7,49,8],[50,2,50,4],[50,7,50,8],[45,2,45,4],[45,7,45,8],[46,2,46,4],[46,7,46,8],[47,2,47,4],[47,7,47,8],[42,2,42,4],[42,7,42,8],[43,2,43,4],[43,7,43,8],[44,2,44,4],[44,7,44,8],[39,2,39,4],[39,7,39,8],[40,2,40,4],[40,7,40,8],[41,2,41,4],[41,7,41,8],[36,2,36,4],[36,7,36,8],[37,2,37,4],[37,7,37,8],[38,2,38,4],[38,7,38,8],[33,2,33,4],[33,7,33,8],[34,2,34,4],[34,7,34,8],[35,2,35,4],[35,7,35,8],[30,2,30,4],[30,7,30,8],[31,2,31,4],[31,7,31,8],[32,2,32,4],[32,7,32,8],[27,2,27,4],[27,7,27,8],[28,2,28,4],[28,7,28,8],[29,2,29,4],[29,7,29,8],[24,2,24,4],[24,7,24,8],[25,2,25,4],[25,7,25,8],[26,2,26,4],[26,7,26,8],[21,2,21,4],[21,7,21,8],[22,2,22,4],[22,7,22,8],[23,2,23,4],[23,7,23,8],[18,2,18,4],[18,7,18,8],[19,2,19,4],[19,7,19,8],[20,2,20,4],[20,7,20,8],[18,9,18,11],[19,9,19,11],[20,9,20,11],[21,9,21,11],[22,9,22,11],[23,9,23,11],[24,9,24,11],[25,9,25,11],[26,9,26,11],[27,9,27,11],[28,9,28,11],[29,9,29,11],[30,9,30,11],[31,9,31,11],[32,9,32,11],[33,9,33,11],[34,9,34,11],[35,9,35,11],[36,9,36,11],[37,9,37,11],[38,9,38,11],[39,9,39,11],[40,9,40,11],[41,9,41,11],[42,9,42,11],[43,9,43,11],[44,9,44,11],[45,9,45,11],[46,9,46,11],[47,9,47,11],[48,9,48,11],[49,9,49,11],[50,9,50,11],[51,9,51,11],[52,9,52,11],[53,9,53,11],[54,9,54,11],[55,9,55,11],[56,9,56,11],[57,9,57,11],[58,9,58,11],[59,9,59,11],[60,9,60,11],[61,9,61,11],[62,9,62,11],[63,9,63,11],[64,9,64,11],[65,9,65,11],[122,9,122,11],[123,9,123,11],[124,9,124,11],[125,9,125,11],[126,9,126,11],[127,9,127,11],[128,9,128,11],[129,9,129,11],[130,9,130,11],[131,9,131,11],[132,9,132,11],[133,9,133,11],[134,9,134,11],[135,9,135,11],[136,9,136,11],[137,9,137,11],[138,9,138,11],[139,9,139,11],[155,9,155,11],[156,9,156,11],[157,9,157,11],[140,9,140,11],[141,9,141,11],[142,9,142,11],[143,9,143,11],[144,9,144,11],[145,9,145,11],[146,9,146,11],[147,9,147,11],[148,9,148,11],[0,3,0,4],[0,5,0,6],[15,7,15,8],[172,7,172,8],[173,7,173,8],[1,1,1,3],[1,4,1,6],[167,9,167,11],[168,9,168,11],[158,9,158,11],[159,9,159,11],[160,9,160,11],[161,9,161,11],[162,9,162,11],[163,9,163,11],[164,9,164,11],[165,9,165,11],[166,9,166,11],[149,9,149,11],[150,9,150,11],[151,9,151,11],[152,9,152,11],[153,9,153,11],[154,9,154,11],[66,9,66,11],[67,2,67,4],[67,7,67,8],[67,9,67,11],[68,2,68,4],[68,7,68,8],[68,9,68,11],[69,2,69,4],[69,7,69,8],[69,9,69,11],[70,9,70,11],[71,2,71,4],[71,7,71,8],[71,9,71,11],[72,2,72,4],[72,7,72,8],[72,9,72,11],[73,2,73,4],[73,7,73,8],[73,9,73,11],[74,9,74,11],[75,2,75,4],[75,7,75,8],[75,9,75,11],[76,2,76,4],[76,7,76,8],[76,9,76,11],[77,2,77,4],[77,7,77,8],[77,9,77,11],[74,2,74,4],[74,7,74,8],[78,9,78,11],[79,2,79,4],[79,7,79,8],[79,9,79,11],[80,2,80,4],[80,7,80,8],[80,9,80,11],[81,2,81,4],[81,7,81,8],[81,9,81,11],[78,2,78,4],[78,7,78,8],[82,9,82,11],[83,2,83,4],[83,7,83,8],[83,9,83,11],[84,2,84,4],[84,7,84,8],[84,9,84,11],[85,2,85,4],[85,7,85,8],[85,9,85,11],[82,2,82,4],[82,7,82,8],[86,2,86,4],[86,7,86,8],[86,9,86,11],[87,2,87,4],[87,7,87,8],[87,9,87,11],[88,2,88,4],[88,7,88,8],[88,9,88,11],[89,2,89,4],[89,7,89,8],[89,9,89,11],[90,2,90,4],[90,7,90,8],[90,9,90,11],[91,2,91,4],[91,7,91,8],[91,9,91,11],[92,2,92,4],[92,7,92,8],[92,9,92,11],[93,2,93,4],[93,7,93,8],[93,9,93,11],[94,2,94,4],[94,7,94,8],[94,9,94,11],[95,2,95,4],[95,7,95,8],[95,9,95,11],[96,2,96,4],[96,7,96,8],[96,9,96,11],[97,2,97,4],[97,7,97,8],[97,9,97,11],[98,2,98,4],[98,7,98,8],[98,9,98,11],[99,2,99,4],[99,7,99,8],[99,9,99,11],[100,2,100,4],[100,7,100,8],[100,9,100,11],[101,2,101,4],[101,7,101,8],[101,9,101,11],[102,2,102,4],[102,7,102,8],[102,9,102,11],[103,2,103,4],[103,7,103,8],[103,9,103,11],[104,2,104,4],[104,7,104,8],[104,9,104,11],[105,2,105,4],[105,7,105,8],[105,9,105,11],[106,2,106,4],[106,7,106,8],[106,9,106,11],[107,2,107,4],[107,7,107,8],[107,9,107,11],[108,2,108,4],[108,7,108,8],[108,9,108,11],[109,2,109,4],[109,7,109,8],[109,9,109,11],[118,9,118,11],[118,7,118,8],[118,2,118,4],[110,2,110,4],[110,7,110,8],[110,9,110,11],[114,2,114,4],[114,7,114,8],[114,9,114,11],[115,2,115,4],[115,7,115,8],[115,9,115,11],[111,2,111,4],[111,7,111,8],[111,9,111,11],[112,2,112,4],[112,7,112,8],[112,9,112,11],[113,2,113,4],[113,7,113,8],[113,9,113,11],[116,9,116,11],[117,9,117,11],[116,2,116,4]]}
[null,"Konto 2","Jugendwehr",{"$f":"'Übersicht Banken u. Kassen'!B4","v":"VR-Bank Kalifornien "},null,{"$f":"'Übersicht Banken u. Kassen'!C4","v":"DE 35 213500 08 001183 223"}]
[null,{"$f":"'Gesamt-Einnahmen und Ausgaben'!A2","v":"Einnahmen- und Ausgaben für das Haushaltsjahr "},null,null,{"$f":"'Gesamt-Einnahmen und Ausgaben'!D2","v":2022},null,null,null,null,null,{"$f":"'Bankkonto-Wehr'!K2:L2","v":"Planung 2022"}]
[null,{"$f":"'Gesamt-Einnahmen und Ausgaben'!A3","v":"Nr."},{"$f":"'Gesamt-Einnahmen und Ausgaben'!B3","v":"Bezeichnung"},{"$f":"'Gesamt-Einnahmen und Ausgaben'!C3","v":"Einnahmen "},{"$f":"'Gesamt-Einnahmen und Ausgaben'!D3","v":"Erläuterungen"},{"$f":"'Gesamt-Einnahmen und Ausgaben'!E3","v":"Nr."},{"$f":"'Gesamt-Einnahmen und Ausgaben'!F3","v":"Bezeichnung"},{"$f":"'Gesamt-Einnahmen und Ausgaben'!G3","v":"Ausgaben "},{"$f":"'Gesamt-Einnahmen und Ausgaben'!H3","v":"Erläuterungen"},null,"Einnahmen ","Ausgaben "]
[null,1,2,3,4,5,6,7,8]
[null,{"$f":"'Gesamt-Einnahmen und Ausgaben'!A5","v":0},{"$f":"'Gesamt-Einnahmen und Ausgaben'!B5","v":"Zuwendungen von Mitgliedern"},{"$f":"SUMIF(F$20:F$169,B5,G$20:G$169)","v":10002},null,{"$f":"'Gesamt-Einnahmen und Ausgaben'!E5","v":8},{"$f":"'Gesamt-Einnahmen und Ausgaben'!F5","v":"Ausgaben für Kameradschaftspflege und Versammlungen"},{"$f":"SUMIF(F$20:F$169,F5,H$20:H$169)","v":10001},null,null,1000,2000]
[null,{"$f":"'Gesamt-Einnahmen und Ausgaben'!A6","v":1},{"$f":"'Gesamt-Einnahmen und Ausgaben'!B6","v":"Zuwendungen von Dritten"},10002,null,{"$f":"'Gesamt-Einnahmen und Ausgaben'!E6","v":9},{"$f":"'Gesamt-Einnahmen und Ausgaben'!F6","v":"Ausgaben für Ehrungen, Geschenke und ähnliche Anlässe"},10008,null,null,1000,1000]
[null,{"$f":"'Gesamt-Einnahmen und Ausgaben'!A7","v":2},{"$f":"'Gesamt-Einnahmen und Ausgaben'!B7","v":"Einnahmen aus Veranstaltungen "},10002,null,{"$f":"'Gesamt-Einnahmen und Ausgaben'!E7","v":10},{"$f":"'Gesamt-Einnahmen und Ausgaben'!F7","v":"Ausgaben für Veranstaltungen "},10001,null,null,1000,1000]
[null,{"$f":"'Gesamt-Einnahmen und Ausgaben'!A8","v":3},{"$f":"'Gesamt-Einnahmen und Ausgaben'!B8","v":"Veräußerung von Vermögens-gegenständen im Einzelwert ab 500 € "},10002,{"$f":"'Gesamt-Einnahmen und Ausgaben'!D8","v":"Einnahmen aus Abgängen von der Bestandsliste"},{"$f":"'Gesamt-Einnahmen und Ausgaben'!E8","v":11},{"$f":"'Gesamt-Einnahmen und Ausgaben'!F8","v":"Erwerb von Vermögensgegenständen im Einzelwert ab 500 € "},10001,{"$f":"'Gesamt-Einnahmen und Ausgaben'!H8","v":"Ausgaben für Zugänge zur Bestandsliste"},null,1000,1000]
[null,{"$f":"'Gesamt-Einnahmen und Ausgaben'!A9","v":4},{"$f":"'Gesamt-Einnahmen und Ausgaben'!B9","v":"Erstattung von Auslagen durch Gemeinde und Dritte"},10002,null,{"$f":"'Gesamt-Einnahmen und Ausgaben'!E9","v":12},{"$f":"'Gesamt-Einnahmen und Ausgaben'!F9","v":"Auslagen für Gemeinde und Dritte"},10001,null,null,1000,1000]
[null,{"$f":"'Gesamt-Einnahmen und Ausgaben'!A10","v":5},{"$f":"'Gesamt-Einnahmen und Ausgaben'!B10","v":"Sonstige Einnahmen"},10002,null,{"$f":"'Gesamt-Einnahmen und Ausgaben'!E10","v":13},{"$f":"'Gesamt-Einnahmen und Ausgaben'!F10","v":"Sonstige Ausgaben"},10001,null,null,1000,1000]
[null,{"$f":"'Gesamt-Einnahmen und Ausgaben'!A11","v":6},{"$f":"'Gesamt-Einnahmen und Ausgaben'!B11","v":"Einzahlungen der Gemeinde"},10002,null,{"$f":"'Gesamt-Einnahmen und Ausgaben'!E11","v":14},{"$f":"'Gesamt-Einnahmen und Ausgaben'!F11","v":"Auszahlungen an die Gemeinde"},10001,null,null,1000,1000]
[null,{"$f":"'Gesamt-Einnahmen und Ausgaben'!A12","v":7},{"$f":"'Gesamt-Einnahmen und Ausgaben'!B12","v":"Entnahme aus der Rücklage"},{"$f":"IF((H5+H6+H7+H8+H9+H10+H11)>(D5+D6+D7+D8+D9+D10+D11),H5+H6+H7+H8+H9+H10+H11-D5-D6-D7-D8-D9-D10-D11,0)","v":0},"Automatische Buchung",{"$f":"'Gesamt-Einnahmen und Ausgaben'!E12","v":15},{"$f":"'Gesamt-Einnahmen und Ausgaben'!F12","v":"Zuführung zur Rücklage"},{"$f":"IF((H5+H6+H7+H8+H9+H10+H11)<(D5+D6+D7+D8+D9+D10+D11),D5+D6+D7+D8+D9+D10+D11-H5-H6-H7-H8-H9-H10-H11,0)","v":0},"Automatische Buchung"]
[null,{"$f":"'Gesamt-Einnahmen und Ausgaben'!A13","v":" 0-7"},{"$f":"'Gesamt-Einnahmen und Ausgaben'!B13","v":"Gesamteinnahmen"},{"$f":"SUM(D5:D12)","v":70014},null,{"$f":"'Gesamt-Einnahmen und Ausgaben'!E13","v":" 8-15"},{"$f":"'Gesamt-Einnahmen und Ausgaben'!F13","v":"Gesamtausgaben"},{"$f":"SUM(H5:H12)","v":70014}," ",null,{"$f":"SUM(K5:K12)","v":7000},{"$f":"SUM(L5:L12)","v":8000}]
[null,"© Ludwig Fink; Landesfeuerwehrverband Schleswig-Holstein",null,null,null,null,{"$f":"'Gesamt-Einnahmen und Ausgaben'!F14","v":"Die Ausgaben werden für gegenseitig deckungsfähig erklärt."}]
[null,"U","Umbuchungen zw. Konten und Kassen",{"$f":"SUMIF(F$20:F$169,B15,G$20:G$169)","v":1000},null,"U","Umbuchungen zw. Konten und Kassen",{"$f":"SUMIF(F$20:F$169,F15,H$20:H$169)","v":1000}]
["Zeilen:",{"$f":"A169","v":150},null,"Bitte Kommentar beachten",null,null,{"$f":"'Übersicht Banken u. Kassen'!D2","v":"Stand am 1. Januar gemäß Kontoauszug/ Kassenaufnahmeprotokoll"},{"$f":"'Übersicht Banken u. Kassen'!E2","v":"Aktueller Stand gemäß Buchführung"}]
[null,"Sprung zu:","Bedienungshinweise!A1",null,null,null,{"$f":"'Übersicht Banken u. Kassen'!D4","v":1},null,{"$f":"G17+G171","v":1},{"$f":"IF(I17<0,\"Fehler! Kann nicht negativ werden\",\"OK\")","v":"OK"}]
[]
["Beleg-Nr.","Datum","Bezeichnung",null,null,"Kennziffer","Einnahme/Einzahlung","Ausgabe/Auszahlung",null,"Bemerkungen"]
[1,null,null,null,null,0,10002]
[{"$f":"A20+1","v":2},null,"Bitte vor Gebrauch Kennziffern und Beträge löschen",null,null,1,10002]
[{"$f":"A21+1","v":3},null,null,null,null,2,10002]
[4,null,null,null,null,3,10002]
[5,null,null,null,null,4,10002]
[6,null,null,null,null,5,10002]
[7,null,null,null,null,6,10002]
[8,null,null,null,null,8,null,10001]
[9,null,null,null,null,9,null,10001]
[10,null,null,null,null,10,null,10001]
[11,null,null,null,null,11,null,10001]
[12,null,null,null,null,12,null,10001]
[13,null,null,null,null,13,null,10001]
[14,null,null,null,null,14,null,10001]
[15,null,null,null,null,"u",null,1000]
[16,null,null,null,null,"u",500]
[17,null,null,null,null,"u",500]
[18,null,null,null,null,9,null,7]
[19]
[20]
[21]
[22]
[23]
[24]
[25]
[26]
[27]
[28]
[29]
[30]
[31]
[32]
[33]
[34]
[35]
[36]
[37]
[38]
[39]
[40]
[41]
[42]
[43]
[44]
[45]
[46]
[47]
[48]
[49]
[50]
[51]
[52]
[53]
[54]
[55]
[56]
[57]
[58]
[59]
[60]
[61]
[62]
[63]
[64]
[65]
[66]
[67]
[68]
[69]
[70]
[71]
[72]
[73]
[74]
[75]
[76]
[77]
[78]
[79]
[80]
[81]
[82]
[83]
[84]
[85]
[86]
[87]
[88]
[89]
[90]
[91]
[92]
[93]
[94]
[95]
[96]
[97]
[98]
[99]
[100]
[{"$f":"A119+1","v":101}]
[102]
[103]
[104]
[105]
[106]
[107]
[108]
[109]
[110]
[111]
[112]
[113]
[114]
[115]
[116]
[{"$f":"A135+1","v":117}]
[118]
[119]
[120]
[121]
[122]
[123]
[124]
[125]
[126]
[127]
[128]
[129]
[130]
[131]
[132]
[133]
[134]
[135]
[136]
[137]
[138]
[139]
[140]
[141]
[142]
[143]
[144]
[145]
[146]
[147]
[148]
[149]
[{"$f":"A168+1","v":150}]
[null,null,null,null,null,"Summe:",{"$f":"ROUND(SUM(G20:G169),2)","v":71014},{"$f":"ROUND(SUM(H20:H169),2)","v":71014}]
[null,null,null,null,null,"aktuelle Veränderung",{"$f":"G170-H170","v":0}]
[]
[null,null,null,null,null,"Kontrolle",{"$f":"ROUND(SUM(D5:D11)-G170+D15,2)","v":0},{"$f":"ROUND(SUM(H5:H11)-H170+H15,2)","v":0}]
[null,null,null,null,null,"muss Null ergeben",{"$f":"IF(G173=0,\"OK\",\"Fehler\")","v":"OK"},{"$f":"IF(H173=0,\"OK\",\"Fehler\")","v":"OK"}]

{"sheet":"Kasse-Jugendwehr","index":6,"n_rows":174,"n_cols":12,"rows_kept":174,"cut":false,"hidden":false,"merged":[[117,2,117,4],[117,7,117,8],[117,9,117,11],[118,2,118,4],[118,7,118,8],[118,9,118,11],[114,2,114,4],[114,7,114,8],[114,9,114,11],[115,2,115,4],[115,7,115,8],[115,9,115,11],[116,2,116,4],[116,7,116,8],[116,9,116,11],[111,2,111,4],[111,7,111,8],[111,9,111,11],[112,2,112,4],[112,7,112,8],[112,9,112,11],[113,2,113,4],[113,7,113,8],[113,9,113,11],[108,2,108,4],[108,7,108,8],[108,9,108,11],[109,2,109,4],[109,7,109,8],[109,9,109,11],[110,2,110,4],[110,7,110,8],[110,9,110,11],[105,2,105,4],[105,7,105,8],[105,9,105,11],[106,2,106,4],[106,7,106,8],[106,9,106,11],[107,2,107,4],[107,7,107,8],[107,9,107,11],[102,2,102,4],[102,7,102,8],[102,9,102,11],[103,2,103,4],[103,7,103,8],[103,9,103,11],[104,2,104,4],[104,7,104,8],[104,9,104,11],[99,2,99,4],[99,7,99,8],[99,9,99,11],[100,2,100,4],[100,7,100,8],[100,9,100,11],[101,2,101,4],[101,7,101,8],[101,9,101,11],[96,2,96,4],[96,7,96,8],[96,9,96,11],[97,2,97,4],[97,7,97,8],[97,9,97,11],[98,2,98,4],[98,7,98,8],[98,9,98,11],[93,2,93,4],[93,7,93,8],[93,9,93,11],[94,2,94,4],[94,7,94,8],[94,9,94,11],[95,2,95,4],[95,7,95,8],[95,9,95,11],[90,2,90,4],[90,7,90,8],[90,9,90,11],[91,2,91,4],[91,7,91,8],[91,9,91,11],[92,2,92,4],[92,7,92,8],[92,9,92,11],[87,2,87,4],[87,7,87,8],[87,9,87,11],[88,2,88,4],[88,7,88,8],[88,9,88,11],[89,2,89,4],[89,7,89,8],[89,9,89,11],[84,2,84,4],[84,7,84,8],[84,9,84,11],[85,2,85,4],[85,7,85,8],[85,9,85,11],[86,2,86,4],[86,7,86,8],[86,9,86,11],[81,2,81,4],[81,7,81,8],[81,9,81,11],[82,2,82,4],[82,7,82,8],[82,9,82,11],[83,2,83,4],[83,7,83,8],[83,9,83,11],[1,10,1,11],[18,2,18,4],[19,2,19,4],[20,2,20,4],[21,2,21,4],[22,2,22,4],[23,2,23,4],[30,2,30,4],[31,2,31,4],[18,7,18,8],[19,7,19,8],[20,7,20,8],[21,7,21,8],[22,7,22,8],[23,7,23,8],[24,7,24,8],[25,7,25,8],[26,7,26,8],[27,7,27,8],[28,7,28,8],[29,7,29,8],[30,7,30,8],[31,7,31,8],[18,9,18,11],[32,2,32,4],[33,2,33,4],[34,2,34,4],[35,2,35,4],[24,2,24,4],[25,2,25,4],[26,2,26,4],[27,2,27,4],[28,2,28,4],[29,2,29,4],[42,2,42,4],[43,2,43,4],[44,2,44,4],[45,2,45,4],[46,2,46,4],[47,2,47,4],[36,2,36,4],[37,2,37,4],[38,2,38,4],[39,2,39,4],[40,2,40,4],[41,2,41,4],[54,2,54,4],[55,2,55,4],[56,2,56,4],[57,2,57,4],[58,2,58,4],[59,2,59,4],[48,2,48,4],[49,2,49,4],[50,2,50,4],[51,2,51,4],[52,2,52,4],[53,2,53,4],[66,2,66,4],[67,2,67,4],[68,2,68,4],[119,2,119,4],[120,2,120,4],[121,2,121,4],[60,2,60,4],[61,2,61,4],[62,2,62,4],[63,2,63,4],[64,2,64,4],[65,2,65,4],[69,2,69,4],[70,2,70,4],[71,2,71,4],[72,2,72,4],[73,2,73,4],[74,2,74,4],[75,2,75,4],[76,2,76,4],[77,2,77,4],[78,2,78,4],[79,2,79,4],[80,2,80,4],[128,2,128,4],[129,2,129,4],[130,2,130,4],[131,2,131,4],[132,2,132,4],[133,2,133,4],[122,2,122,4],[123,2,123,4],[124,2,124,4],[125,2,125,4],[126,2,126,4],[127,2,127,4],[140,2,140,4],[141,2,141,4],[142,2,142,4],[143,2,143,4],[144,2,144,4],[145,2,145,4],[134,2,134,4],[135,2,135,4],[136,2,136,4],[137,2,137,4],[138,2,138,4],[139,2,139,4],[152,2,152,4],[153,2,153,4],[154,2,154,4],[155,2,155,4],[156,2,156,4],[157,2,157,4],[146,2,146,4],[147,2,147,4],[148,2,148,4],[149,2,149,4],[150,2,150,4],[151,2,151,4],[164,2,164,4],[165,2,165,4],[166,2,166,4],[167,2,167,4],[168,2,168,4],[169,2,169,4],[158,2,158,4],[159,2,159,4],[160,2,160,4],[161,2,161,4],[162,2,162,4],[163,2,163,4],[32,7,32,8],[33,7,33,8],[34,7,34,8],[35,7,35,8],[36,7,36,8],[37,7,37,8],[38,7,38,8],[39,7,39,8],[40,7,40,8],[41,7,41,8],[42,7,42,8],[43,7,43,8],[44,7,44,8],[45,7,45,8],[46,7,46,8],[47,7,47,8],[48,7,48,8],[49,7,49,8],[50,7,50,8],[51,7,51,8],[52,7,52,8],[53,7,53,8],[54,7,54,8],[55,7,55,8],[56,7,56,8],[57,7,57,8],[58,7,58,8],[59,7,59,8],[60,7,60,8],[61,7,61,8],[62,7,62,8],[63,7,63,8],[64,7,64,8],[65,7,65,8],[66,7,66,8],[67,7,67,8],[68,7,68,8],[119,7,119,8],[120,7,120,8],[121,7,121,8],[122,7,122,8],[123,7,123,8],[124,7,124,8],[125,7,125,8],[126,7,126,8],[69,7,69,8],[70,7,70,8],[71,7,71,8],[72,7,72,8],[73,7,73,8],[74,7,74,8],[75,7,75,8],[76,7,76,8],[77,7,77,8],[78,7,78,8],[79,7,79,8],[80,7,80,8],[127,7,127,8],[128,7,128,8],[129,7,129,8],[130,7,130,8],[131,7,131,8],[132,7,132,8],[133,7,133,8],[134,7,134,8],[135,7,135,8],[136,7,136,8],[137,7,137,8],[138,7,138,8],[139,7,139,8],[140,7,140,8],[141,7,141,8],[142,7,142,8],[143,7,143,8],[144,7,144,8],[145,7,145,8],[146,7,146,8],[147,7,147,8],[148,7,148,8],[149,7,149,8],[150,7,150,8],[151,7,151,8],[152,7,152,8],[153,7,153,8],[163,7,163,8],[164,7,164,8],[165,7,165,8],[166,7,166,8],[167,7,167,8],[168,7,168,8],[169,7,169,8],[154,7,154,8],[155,7,155,8],[156,7,156,8],[157,7,157,8],[158,7,158,8],[159,7,159,8],[160,7,160,8],[161,7,161,8],[162,7,162,8],[19,9,19,11],[20,9,20,11],[21,9,21,11],[22,9,22,11],[23,9,23,11],[24,9,24,11],[25,9,25,11],[26,9,26,11],[27,9,27,11],[28,9,28,11],[29,9,29,11],[30,9,30,11],[31,9,31,11],[32,9,32,11],[33,9,33,11],[34,9,34,11],[35,9,35,11],[36,9,36,11],[37,9,37,11],[38,9,38,11],[39,9,39,11],[40,9,40,11],[41,9,41,11],[42,9,42,11],[43,9,43,11],[44,9,44,11],[45,9,45,11],[46,9,46,11],[47,9,47,11],[48,9,48,11],[49,9,49,11],[50,9,50,11],[51,9,51,11],[52,9,52,11],[53,9,53,11],[54,9,54,11],[55,9,55,11],[56,9,56,11],[57,9,57,11],[58,9,58,11],[59,9,59,11],[60,9,60,11],[61,9,61,11],[62,9,62,11],[63,9,63,11],[64,9,64,11],[65,9,65,11],[66,9,66,11],[67,9,67,11],[68,9,68,11],[119,9,119,11],[120,9,120,11],[121,9,121,11],[122,9,122,11],[69,9,69,11],[70,9,70,11],[71,9,71,11],[72,9,72,11],[73,9,73,11],[74,9,74,11],[75,9,75,11],[76,9,76,11],[77,9,77,11],[78,9,78,11],[79,9,79,11],[80,9,80,11],[123,9,123,11],[124,9,124,11],[125,9,125,11],[126,9,126,11],[127,9,127,11],[128,9,128,11],[129,9,129,11],[130,9,130,11],[131,9,131,11],[132,9,132,11],[133,9,133,11],[134,9,134,11],[135,9,135,11],[136,9,136,11],[137,9,137,11],[138,9,138,11],[139,9,139,11],[140,9,140,11],[141,9,141,11],[142,9,142,11],[143,9,143,11],[144,9,144,11],[145,9,145,11],[146,9,146,11],[147,9,147,11],[148,9,148,11],[149,9,149,11],[15,7,15,8],[172,7,172,8],[173,7,173,8],[1,1,1,3],[1,4,1,6],[168,9,168,11],[159,9,159,11],[160,9,160,11],[161,9,161,11],[162,9,162,11],[163,9,163,11],[164,9,164,11],[165,9,165,11],[166,9,166,11],[167,9,167,11],[150,9,150,11],[151,9,151,11],[152,9,152,11],[153,9,153,11],[154,9,154,11],[155,9,155,11],[156,9,156,11],[157,9,157,11],[158,9,158,11]]}
[null,"Kasse 2","Jugendfeuerwehr"]
[null,{"$f":"'Gesamt-Einnahmen und Ausgaben'!A2","v":"Einnahmen- und Ausgaben für das Haushaltsjahr "},null,null,{"$f":"'Gesamt-Einnahmen und Ausgaben'!D2","v":2022},null,null,null,null,null,{"$f":"'Bankkonto-Wehr'!K2:L2","v":"Planung 2022"}]
[null,{"$f":"'Gesamt-Einnahmen und Ausgaben'!A3","v":"Nr."},{"$f":"'Gesamt-Einnahmen und Ausgaben'!B3","v":"Bezeichnung"},{"$f":"'Gesamt-Einnahmen und Ausgaben'!C3","v":"Einnahmen "},{"$f":"'Gesamt-Einnahmen und Ausgaben'!D3","v":"Erläuterungen"},{"$f":"'Gesamt-Einnahmen und Ausgaben'!E3","v":"Nr."},{"$f":"'Gesamt-Einnahmen und Ausgaben'!F3","v":"Bezeichnung"},{"$f":"'Gesamt-Einnahmen und Ausgaben'!G3","v":"Ausgaben "},{"$f":"'Gesamt-Einnahmen und Ausgaben'!H3","v":"Erläuterungen"},null,"Einnahmen ","Ausgaben "]
[null,1,2,3,4,5,6,7,8]
[null,{"$f":"'Gesamt-Einnahmen und Ausgaben'!A5","v":0},{"$f":"'Gesamt-Einnahmen und Ausgaben'!B5","v":"Zuwendungen von Mitgliedern"},{"$f":"SUMIF(F$20:F$169,B5,G$20:G$169)","v":10002},null,{"$f":"'Gesamt-Einnahmen und Ausgaben'!E5","v":8},{"$f":"'Gesamt-Einnahmen und Ausgaben'!F5","v":"Ausgaben für Kameradschaftspflege und Versammlungen"},{"$f":"SUMIF(F$20:F$169,F5,H$20:H$169)","v":10001},null,null,1000,2000]
[null,{"$f":"'Gesamt-Einnahmen und Ausgaben'!A6","v":1},{"$f":"'Gesamt-Einnahmen und Ausgaben'!B6","v":"Zuwendungen von Dritten"},10002,null,{"$f":"'Gesamt-Einnahmen und Ausgaben'!E6","v":9},{"$f":"'Gesamt-Einnahmen und Ausgaben'!F6","v":"Ausgaben für Ehrungen, Geschenke und ähnliche Anlässe"},10001,null,null,1000,1000]
[null,{"$f":"'Gesamt-Einnahmen und Ausgaben'!A7","v":2},{"$f":"'Gesamt-Einnahmen und Ausgaben'!B7","v":"Einnahmen aus Veranstaltungen "},10002,null,{"$f":"'Gesamt-Einnahmen und Ausgaben'!E7","v":10},{"$f":"'Gesamt-Einnahmen und Ausgaben'!F7","v":"Ausgaben für Veranstaltungen "},10001,null,null,1000,1000]
[null,{"$f":"'Gesamt-Einnahmen und Ausgaben'!A8","v":3},{"$f":"'Gesamt-Einnahmen und Ausgaben'!B8","v":"Veräußerung von Vermögens-gegenständen im Einzelwert ab 500 € "},10002,{"$f":"'Gesamt-Einnahmen und Ausgaben'!D8","v":"Einnahmen aus Abgängen von der Bestandsliste"},{"$f":"'Gesamt-Einnahmen und Ausgaben'!E8","v":11},{"$f":"'Gesamt-Einnahmen und Ausgaben'!F8","v":"Erwerb von Vermögensgegenständen im Einzelwert ab 500 € "},10001,null,null,1000,1000]
[null,{"$f":"'Gesamt-Einnahmen und Ausgaben'!A9","v":4},{"$f":"'Gesamt-Einnahmen und Ausgaben'!B9","v":"Erstattung von Auslagen durch Gemeinde und Dritte"},10002,null,{"$f":"'Gesamt-Einnahmen und Ausgaben'!E9","v":12},{"$f":"'Gesamt-Einnahmen und Ausgaben'!F9","v":"Auslagen für Gemeinde und Dritte"},10001,null,null,1000,1000]
[null,{"$f":"'Gesamt-Einnahmen und Ausgaben'!A10","v":5},{"$f":"'Gesamt-Einnahmen und Ausgaben'!B10","v":"Sonstige Einnahmen"},10002,null,{"$f":"'Gesamt-Einnahmen und Ausgaben'!E10","v":13},{"$f":"'Gesamt-Einnahmen und Ausgaben'!F10","v":"Sonstige Ausgaben"},10001,null,null,1000,1000]
[null,{"$f":"'Gesamt-Einnahmen und Ausgaben'!A11","v":6},{"$f":"'Gesamt-Einnahmen und Ausgaben'!B11","v":"Einzahlungen der Gemeinde"},10002,null,{"$f":"'Gesamt-Einnahmen und Ausgaben'!E11","v":14},{"$f":"'Gesamt-Einnahmen und Ausgaben'!F11","v":"Auszahlungen an die Gemeinde"},10001,null,null,1000,1000]
[null,{"$f":"'Gesamt-Einnahmen und Ausgaben'!A12","v":7},{"$f":"'Gesamt-Einnahmen und Ausgaben'!B12","v":"Entnahme aus der Rücklage"},{"$f":"IF((H5+H6+H7+H8+H9+H10+H11)>(D5+D6+D7+D8+D9+D10+D11),H5+H6+H7+H8+H9+H10+H11-D5-D6-D7-D8-D9-D10-D11,0)","v":0},"Automatische Buchung",{"$f":"'Gesamt-Einnahmen und Ausgaben'!E12","v":15},{"$f":"'Gesamt-Einnahmen und Ausgaben'!F12","v":"Zuführung zur Rücklage"},{"$f":"IF((H5+H6+H7+H8+H9+H10+H11)<(D5+D6+D7+D8+D9+D10+D11),D5+D6+D7+D8+D9+D10+D11-H5-H6-H7-H8-H9-H10-H11,0)","v":7},"Automatische Buchung"]
[null,{"$f":"'Gesamt-Einnahmen und Ausgaben'!A13","v":" 0-7"},{"$f":"'Gesamt-Einnahmen und Ausgaben'!B13","v":"Gesamteinnahmen"},{"$f":"SUM(D5:D12)","v":70014},null,{"$f":"'Gesamt-Einnahmen und Ausgaben'!E13","v":" 8-15"},{"$f":"'Gesamt-Einnahmen und Ausgaben'!F13","v":"Gesamtausgaben"},{"$f":"SUM(H5:H12)","v":70014}," ",null,{"$f":"SUM(K5:K12)","v":7000},{"$f":"SUM(L5:L12)","v":8000}]
[null,"© Ludwig Fink; Landesfeuerwehrverband Schleswig-Holstein",null,null,null,null,{"$f":"'Gesamt-Einnahmen und Ausgaben'!F14","v":"Die Ausgaben werden für gegenseitig deckungsfähig erklärt."}]
[null,"U","Umbuchungen zw. Konten und Kassen",{"$f":"SUMIF(F$20:F$169,B15,G$20:G$169)","v":1000},null,"U","Umbuchungen zw. Konten und Kassen",{"$f":"SUMIF(F$20:F$169,F15,H$20:H$169)","v":1000}]
["Zeilen:",{"$f":"A169","v":150},null,"Bitte Kommentar beachten",null,null,{"$f":"'Übersicht Banken u. Kassen'!D2","v":"Stand am 1. Januar gemäß Kontoauszug/ Kassenaufnahmeprotokoll"},{"$f":"'Übersicht Banken u. Kassen'!E2","v":"Aktueller Stand gemäß Buchführung"}]
[null,"Sprung zu:","Bedienungshinweise!A1",null,null,null,{"$f":"'Übersicht Banken u. Kassen'!D8","v":1},null,{"$f":"G17+G171","v":8},{"$f":"IF(I17<0,\"Fehler! Kann nicht negativ werden\",\"OK\")","v":"OK"}]
[]
["Beleg-Nr.","Datum","Bezeichnung",null,null,"Kennziffer","Einnahme/Einzahlung","Ausgabe/Auszahlung",null,"Bemerkungen"]
[1,null,null,null,null,0,10002]
[{"$f":"A20+1","v":2},null,"Bitte vor Gebrauch Kennziffern und Beträge löschen",null,null,1,10002]
[{"$f":"A21+1","v":3},null,null,null,null,2,10002]
[4,null,null,null,null,3,10002]
[5,null,null,null,null,4,10002]
[6,null,null,null,null,5,10002]
[7,null,null,null,null,6,10002]
[8,null,null,null,null,8,null,10001]
[9,null,null,null,null,9,null,10001]
[10,null,null,null,null,10,null,10001]
[11,null,null,null,null,11,null,10001]
[12,null,null,null,null,12,null,10001]
[13,null,null,null,null,13,null,10001]
[14,null,null,null,null,14,null,10001]
[15,null,null,null,null,"u",null,1000]
[16,null,null,null,null,"u",500]
[17,null,null,null,null,"u",500]
[18]
[19]
[20]
[21]
[22]
[23]
[24]
[25]
[26]
[27]
[28]
[29]
[30]
[31]
[32]
[33]
[34]
[35]
[36]
[37]
[38]
[39]
[40]
[41]
[42]
[43]
[44]
[45]
[46]
[47]
[48]
[49]
[50]
[51]
[52]
[53]
[54]
[55]
[56]
[57]
[58]
[59]
[60]
[61]
[62]
[63]
[64]
[65]
[66]
[67]
[68]
[69]
[70]
[71]
[72]
[73]
[74]
[75]
[76]
[77]
[78]
[79]
[80]
[81]
[82]
[83]
[84]
[85]
[86]
[87]
[88]
[89]
[90]
[91]
[92]
[93]
[94]
[95]
[96]
[97]
[98]
[99]
[100]
[101]
[102]
[103]
[104]
[105]
[106]
[107]
[108]
[109]
[110]
[111]
[112]
[113]
[114]
[115]
[116]
[{"$f":"A135+1","v":117}]
[118]
[119]
[120]
[121]
[122]
[123]
[124]
[125]
[126]
[127]
[128]
[129]
[130]
[131]
[132]
[133]
[134]
[135]
[136]
[137]
[138]
[139]
[140]
[141]
[142]
[143]
[144]
[145]
[146]
[147]
[148]
[149]
[150]
[null,null,null,null,null,"Summe:",{"$f":"ROUND(SUM(G20:G169),2)","v":71014},{"$f":"ROUND(SUM(H20:H169),2)","v":71007}]
[null,null,null,null,null,"aktuelle Veränderung",{"$f":"G170-H170","v":7}]
[]
[null,null,null,null,null,"Kontrolle",{"$f":"ROUND(SUM(D5:D11)-G170+D15,2)","v":0},{"$f":"ROUND(SUM(H5:H11)-H170+H15,2)","v":0}]
[null,null,null,null,null,"muss Null ergeben",{"$f":"IF(G173=0,\"OK\",\"Fehler\")","v":"OK"},{"$f":"IF(H173=0,\"OK\",\"Fehler\")","v":"OK"}]

{"sheet":"Bankkonto-Musikzug","index":7,"n_rows":174,"n_cols":12,"rows_kept":174,"cut":false,"hidden":false,"merged":[[117,2,117,4],[117,7,117,8],[117,9,117,11],[118,2,118,4],[118,7,118,8],[118,9,118,11],[114,2,114,4],[114,7,114,8],[114,9,114,11],[115,2,115,4],[115,7,115,8],[115,9,115,11],[116,2,116,4],[116,7,116,8],[116,9,116,11],[111,2,111,4],[111,7,111,8],[111,9,111,11],[112,2,112,4],[112,7,112,8],[112,9,112,11],[113,2,113,4],[113,7,113,8],[113,9,113,11],[108,2,108,4],[108,7,108,8],[108,9,108,11],[109,2,109,4],[109,7,109,8],[109,9,109,11],[110,2,110,4],[110,7,110,8],[110,9,110,11],[105,2,105,4],[105,7,105,8],[105,9,105,11],[106,2,106,4],[106,7,106,8],[106,9,106,11],[107,2,107,4],[107,7,107,8],[107,9,107,11],[102,2,102,4],[102,7,102,8],[102,9,102,11],[103,2,103,4],[103,7,103,8],[103,9,103,11],[104,2,104,4],[104,7,104,8],[104,9,104,11],[99,2,99,4],[99,7,99,8],[99,9,99,11],[100,2,100,4],[100,7,100,8],[100,9,100,11],[101,2,101,4],[101,7,101,8],[101,9,101,11],[96,2,96,4],[96,7,96,8],[96,9,96,11],[97,2,97,4],[97,7,97,8],[97,9,97,11],[98,2,98,4],[98,7,98,8],[98,9,98,11],[93,2,93,4],[93,7,93,8],[93,9,93,11],[94,2,94,4],[94,7,94,8],[94,9,94,11],[95,2,95,4],[95,7,95,8],[95,9,95,11],[90,2,90,4],[90,7,90,8],[90,9,90,11],[91,2,91,4],[91,7,91,8],[91,9,91,11],[92,2,92,4],[92,7,92,8],[92,9,92,11],[87,2,87,4],[87,7,87,8],[87,9,87,11],[88,2,88,4],[88,7,88,8],[88,9,88,11],[89,2,89,4],[89,7,89,8],[89,9,89,11],[84,2,84,4],[84,7,84,8],[84,9,84,11],[85,2,85,4],[85,7,85,8],[85,9,85,11],[86,2,86,4],[86,7,86,8],[86,9,86,11],[81,2,81,4],[81,7,81,8],[81,9,81,11],[82,2,82,4],[82,7,82,8],[82,9,82,11],[83,2,83,4],[83,7,83,8],[83,9,83,11],[78,2,78,4],[78,7,78,8],[78,9,78,11],[79,2,79,4],[79,7,79,8],[79,9,79,11],[80,2,80,4],[80,7,80,8],[80,9,80,11],[75,2,75,4],[75,7,75,8],[75,9,75,11],[76,2,76,4],[76,7,76,8],[76,9,76,11],[77,2,77,4],[77,7,77,8],[77,9,77,11],[1,10,1,11],[167,2,167,4],[167,7,167,8],[168,2,168,4],[168,7,168,8],[169,2,169,4],[169,7,169,8],[164,2,164,4],[164,7,164,8],[165,2,165,4],[165,7,165,8],[166,2,166,4],[166,7,166,8],[161,2,161,4],[161,7,161,8],[162,2,162,4],[162,7,162,8],[163,2,163,4],[163,7,163,8],[158,2,158,4],[158,7,158,8],[159,2,159,4],[159,7,159,8],[160,2,160,4],[160,7,160,8],[155,2,155,4],[155,7,155,8],[156,2,156,4],[156,7,156,8],[157,2,157,4],[157,7,157,8],[152,2,152,4],[152,7,152,8],[153,2,153,4],[153,7,153,8],[154,2,154,4],[154,7,154,8],[149,2,149,4],[149,7,149,8],[150,2,150,4],[150,7,150,8],[151,2,151,4],[151,7,151,8],[146,2,146,4],[146,7,146,8],[147,2,147,4],[147,7,147,8],[148,2,148,4],[148,7,148,8],[143,2,143,4],[143,7,143,8],[144,2,144,4],[144,7,144,8],[145,2,145,4],[145,7,145,8],[140,2,140,4],[140,7,140,8],[141,2,141,4],[141,7,141,8],[142,2,142,4],[142,7,142,8],[137,2,137,4],[137,7,137,8],[138,2,138,4],[138,7,138,8],[139,2,139,4],[139,7,139,8],[134,2,134,4],[134,7,134,8],[135,2,135,4],[135,7,135,8],[136,2,136,4],[136,7,136,8],[131,2,131,4],[131,7,131,8],[132,2,132,4],[132,7,132,8],[133,2,133,4],[133,7,133,8],[128,2,128,4],[128,7,128,8],[129,2,129,4],[129,7,129,8],[130,2,130,4],[130,7,130,8],[125,2,125,4],[125,7,125,8],[126,2,126,4],[126,7,126,8],[127,2,127,4],[127,7,127,8],[122,2,122,4],[122,7,122,8],[123,2,123,4],[123,7,123,8],[124,2,124,4],[124,7,124,8],[119,2,119,4],[119,7,119,8],[120,2,120,4],[120,7,120,8],[121,2,121,4],[121,7,121,8],[66,2,66,4],[66,7,66,8],[67,2,67,4],[67,7,67,8],[68,2,68,4],[68,7,68,8],[69,2,69,4],[69,7,69,8],[70,2,70,4],[70,7,70,8],[71,2,71,4],[71,7,71,8],[72,2,72,4],[72,7,72,8],[73,2,73,4],[73,7,73,8],[74,2,74,4],[74,7,74,8],[63,2,63,4],[63,7,63,8],[64,2,64,4],[64,7,64,8],[65,2,65,4],[65,7,65,8],[60,2,60,4],[60,7,60,8],[61,2,61,4],[61,7,61,8],[62,2,62,4],[62,7,62,8],[57,2,57,4],[57,7,57,8],[58,2,58,4],[58,7,58,8],[59,2,59,4],[59,7,59,8],[54,2,54,4],[54,7,54,8],[55,2,55,4],[55,7,55,8],[56,2,56,4],[56,7,56,8],[51,2,51,4],[51,7,51,8],[52,2,52,4],[52,7,52,8],[53,2,53,4],[53,7,53,8],[48,2,48,4],[48,7,48,8],[49,2,49,4],[49,7,49,8],[50,2,50,4],[50,7,50,8],[45,2,45,4],[45,7,45,8],[46,2,46,4],[46,7,46,8],[47,2,47,4],[47,7,47,8],[42,2,42,4],[42,7,42,8],[43,2,43,4],[43,7,43,8],[44,2,44,4],[44,7,44,8],[39,2,39,4],[39,7,39,8],[40,2,40,4],[40,7,40,8],[41,2,41,4],[41,7,41,8],[36,2,36,4],[36,7,36,8],[37,2,37,4],[37,7,37,8],[38,2,38,4],[38,7,38,8],[33,2,33,4],[33,7,33,8],[34,2,34,4],[34,7,34,8],[35,2,35,4],[35,7,35,8],[30,2,30,4],[30,7,30,8],[31,2,31,4],[31,7,31,8],[32,2,32,4],[32,7,32,8],[27,2,27,4],[27,7,27,8],[28,2,28,4],[28,7,28,8],[29,2,29,4],[29,7,29,8],[24,2,24,4],[24,7,24,8],[25,2,25,4],[25,7,25,8],[26,2,26,4],[26,7,26,8],[21,2,21,4],[21,7,21,8],[22,2,22,4],[22,7,22,8],[23,2,23,4],[23,7,23,8],[18,2,18,4],[18,7,18,8],[19,2,19,4],[19,7,19,8],[20,2,20,4],[20,7,20,8],[18,9,18,11],[19,9,19,11],[20,9,20,11],[21,9,21,11],[22,9,22,11],[23,9,23,11],[24,9,24,11],[25,9,25,11],[26,9,26,11],[27,9,27,11],[28,9,28,11],[29,9,29,11],[30,9,30,11],[31,9,31,11],[32,9,32,11],[33,9,33,11],[34,9,34,11],[35,9,35,11],[36,9,36,11],[37,9,37,11],[38,9,38,11],[39,9,39,11],[40,9,40,11],[41,9,41,11],[42,9,42,11],[43,9,43,11],[44,9,44,11],[45,9,45,11],[46,9,46,11],[47,9,47,11],[48,9,48,11],[49,9,49,11],[50,9,50,11],[51,9,51,11],[52,9,52,11],[53,9,53,11],[54,9,54,11],[55,9,55,11],[56,9,56,11],[57,9,57,11],[58,9,58,11],[59,9,59,11],[60,9,60,11],[61,9,61,11],[62,9,62,11],[63,9,63,11],[64,9,64,11],[65,9,65,11],[66,9,66,11],[67,9,67,11],[68,9,68,11],[119,9,119,11],[120,9,120,11],[121,9,121,11],[69,9,69,11],[70,9,70,11],[71,9,71,11],[72,9,72,11],[73,9,73,11],[74,9,74,11],[122,9,122,11],[123,9,123,11],[124,9,124,11],[125,9,125,11],[126,9,126,11],[127,9,127,11],[128,9,128,11],[129,9,129,11],[130,9,130,11],[131,9,131,11],[132,9,132,11],[133,9,133,11],[134,9,134,11],[135,9,135,11],[136,9,136,11],[137,9,137,11],[138,9,138,11],[139,9,139,11],[155,9,155,11],[156,9,156,11],[157,9,157,11],[140,9,140,11],[141,9,141,11],[142,9,142,11],[143,9,143,11],[144,9,144,11],[145,9,145,11],[146,9,146,11],[147,9,147,11],[148,9,148,11],[15,7,15,8],[0,5,0,6],[0,3,0,4],[172,7,172,8],[173,7,173,8],[1,1,1,3],[1,4,1,6],[167,9,167,11],[168,9,168,11],[158,9,158,11],[159,9,159,11],[160,9,160,11],[161,9,161,11],[162,9,162,11],[163,9,163,11],[164,9,164,11],[165,9,165,11],[166,9,166,11],[149,9,149,11],[150,9,150,11],[151,9,151,11],[152,9,152,11],[153,9,153,11],[154,9,154,11]]}
[null,"Bank 3","Musikzug",{"$f":"'Übersicht Banken u. Kassen'!B5","v":"Sparkasse Brasilien"},null,{"$f":"'Übersicht Banken u. Kassen'!C5","v":"DE 76 205700 02 003366 454"}]
[null,{"$f":"'Gesamt-Einnahmen und Ausgaben'!A2","v":"Einnahmen- und Ausgaben für das Haushaltsjahr "},null,null,{"$f":"'Gesamt-Einnahmen und Ausgaben'!D2","v":2022},null,null,null,null,null,{"$f":"'Bankkonto-Wehr'!K2:L2","v":"Planung 2022"}]
[null,{"$f":"'Gesamt-Einnahmen und Ausgaben'!A3","v":"Nr."},{"$f":"'Gesamt-Einnahmen und Ausgaben'!B3","v":"Bezeichnung"},{"$f":"'Gesamt-Einnahmen und Ausgaben'!C3","v":"Einnahmen "},{"$f":"'Gesamt-Einnahmen und Ausgaben'!D3","v":"Erläuterungen"},{"$f":"'Gesamt-Einnahmen und Ausgaben'!E3","v":"Nr."},{"$f":"'Gesamt-Einnahmen und Ausgaben'!F3","v":"Bezeichnung"},{"$f":"'Gesamt-Einnahmen und Ausgaben'!G3","v":"Ausgaben "},{"$f":"'Gesamt-Einnahmen und Ausgaben'!H3","v":"Erläuterungen"},null,"Einnahmen ","Ausgaben "]
[null,1,2,3,4,5,6,7,8]
[null,{"$f":"'Gesamt-Einnahmen und Ausgaben'!A5","v":0},{"$f":"'Gesamt-Einnahmen und Ausgaben'!B5","v":"Zuwendungen von Mitgliedern"},{"$f":"SUMIF(F$20:F$169,B5,G$20:G$169)","v":10002},null,{"$f":"'Gesamt-Einnahmen und Ausgaben'!E5","v":8},{"$f":"'Gesamt-Einnahmen und Ausgaben'!F5","v":"Ausgaben für Kameradschaftspflege und Versammlungen"},{"$f":"SUMIF(F$20:F$169,F5,H$20:H$169)","v":10001},null,null,1000,2000]
[null,{"$f":"'Gesamt-Einnahmen und Ausgaben'!A6","v":1},{"$f":"'Gesamt-Einnahmen und Ausgaben'!B6","v":"Zuwendungen von Dritten"},10002,null,{"$f":"'Gesamt-Einnahmen und Ausgaben'!E6","v":9},{"$f":"'Gesamt-Einnahmen und Ausgaben'!F6","v":"Ausgaben für Ehrungen, Geschenke und ähnliche Anlässe"},10001,null,null,1000,1000]
[null,{"$f":"'Gesamt-Einnahmen und Ausgaben'!A7","v":2},"Einnahmen aus Veranstaltungen und Auftritten des Musikzugs",10002,null,{"$f":"'Gesamt-Einnahmen und Ausgaben'!E7","v":10},{"$f":"'Gesamt-Einnahmen und Ausgaben'!F7","v":"Ausgaben für Veranstaltungen "},10001,null,null,1000,1000]
[null,{"$f":"'Gesamt-Einnahmen und Ausgaben'!A8","v":3},{"$f":"'Gesamt-Einnahmen und Ausgaben'!B8","v":"Veräußerung von Vermögens-gegenständen im Einzelwert ab 500 € "},10002,{"$f":"'Gesamt-Einnahmen und Ausgaben'!D8","v":"Einnahmen aus Abgängen von der Bestandsliste"},{"$f":"'Gesamt-Einnahmen und Ausgaben'!E8","v":11},{"$f":"'Gesamt-Einnahmen und Ausgaben'!F8","v":"Erwerb von Vermögensgegenständen im Einzelwert ab 500 € "},10001,{"$f":"'Gesamt-Einnahmen und Ausgaben'!H8","v":"Ausgaben für Zugänge zur Bestandsliste"},null,1000,1000]
[null,{"$f":"'Gesamt-Einnahmen und Ausgaben'!A9","v":4},{"$f":"'Gesamt-Einnahmen und Ausgaben'!B9","v":"Erstattung von Auslagen durch Gemeinde und Dritte"},10002,null,{"$f":"'Gesamt-Einnahmen und Ausgaben'!E9","v":12},{"$f":"'Gesamt-Einnahmen und Ausgaben'!F9","v":"Auslagen für Gemeinde und Dritte"},10001,null,null,1000,1000]
[null,{"$f":"'Gesamt-Einnahmen und Ausgaben'!A10","v":5},{"$f":"'Gesamt-Einnahmen und Ausgaben'!B10","v":"Sonstige Einnahmen"},10002,null,{"$f":"'Gesamt-Einnahmen und Ausgaben'!E10","v":13},{"$f":"'Gesamt-Einnahmen und Ausgaben'!F10","v":"Sonstige Ausgaben"},10001,null,null,1000,1000]
[null,{"$f":"'Gesamt-Einnahmen und Ausgaben'!A11","v":6},{"$f":"'Gesamt-Einnahmen und Ausgaben'!B11","v":"Einzahlungen der Gemeinde"},10002,null,{"$f":"'Gesamt-Einnahmen und Ausgaben'!E11","v":14},{"$f":"'Gesamt-Einnahmen und Ausgaben'!F11","v":"Auszahlungen an die Gemeinde"},10001,null,null,1000,1000]
[null,{"$f":"'Gesamt-Einnahmen und Ausgaben'!A12","v":7},{"$f":"'Gesamt-Einnahmen und Ausgaben'!B12","v":"Entnahme aus der Rücklage"},{"$f":"IF((H5+H6+H7+H8+H9+H10+H11)>(D5+D6+D7+D8+D9+D10+D11),H5+H6+H7+H8+H9+H10+H11-D5-D6-D7-D8-D9-D10-D11,0)","v":0},"Automatische Buchung",{"$f":"'Gesamt-Einnahmen und Ausgaben'!E12","v":15},{"$f":"'Gesamt-Einnahmen und Ausgaben'!F12","v":"Zuführung zur Rücklage"},{"$f":"IF((H5+H6+H7+H8+H9+H10+H11)<(D5+D6+D7+D8+D9+D10+D11),D5+D6+D7+D8+D9+D10+D11-H5-H6-H7-H8-H9-H10-H11,0)","v":7},"Automatische Buchung"]
[null,{"$f":"'Gesamt-Einnahmen und Ausgaben'!A13","v":" 0-7"},{"$f":"'Gesamt-Einnahmen und Ausgaben'!B13","v":"Gesamteinnahmen"},{"$f":"SUM(D5:D12)","v":70014},null,{"$f":"'Gesamt-Einnahmen und Ausgaben'!E13","v":" 8-15"},{"$f":"'Gesamt-Einnahmen und Ausgaben'!F13","v":"Gesamtausgaben"},{"$f":"SUM(H5:H12)","v":70014}," ",null,{"$f":"SUM(K5:K12)","v":7000},{"$f":"SUM(L5:L12)","v":8000}]
[null,"© Ludwig Fink; Landesfeuerwehrverband Schleswig-Holstein",null,null,null,null,{"$f":"'Gesamt-Einnahmen und Ausgaben'!F14","v":"Die Ausgaben werden für gegenseitig deckungsfähig erklärt."}]
[null,"U","Umbuchungen zw. Konten und Kassen",{"$f":"SUMIF(F$20:F$170,B15,G$20:G$170)","v":1000},null,"U","Umbuchungen zw. Konten und Kassen",{"$f":"SUMIF(F$20:F$170,F15,H$20:H$170)","v":1000}]
["Zeilen:",{"$f":"A169","v":150},null,"Bitte Kommentar beachten",null,null,{"$f":"'Übersicht Banken u. Kassen'!D2","v":"Stand am 1. Januar gemäß Kontoauszug/ Kassenaufnahmeprotokoll"},{"$f":"'Übersicht Banken u. Kassen'!E2","v":"Aktueller Stand gemäß Buchführung"}]
[null,"Sprung zu:","Bedienungshinweise!A1",null,null,null,{"$f":"'Übersicht Banken u. Kassen'!D5","v":1},null,{"$f":"G17+G171","v":8},{"$f":"IF(I17<0,\"Fehler! Kann nicht negativ werden\",\"OK\")","v":"OK"}]
[]
["Beleg-Nr.","Datum","Bezeichnung",null,null,"Kennziffer","Einnahme/Einzahlung","Ausgabe/Auszahlung",null,"Bemerkungen"]
[1,null,null,null,null,0,10002]
[{"$f":"A20+1","v":2},null,"Bitte vor Gebrauch Kennziffern und Beträge löschen",null,null,1,10002]
[{"$f":"A21+1","v":3},null,null,null,null,2,10002]
[4,null,null,null,null,3,10002]
[5,null,null,null,null,4,10002]
[6,null,null,null,null,5,10002]
[7,null,null,null,null,6,10002]
[8,null,null,null,null,8,null,10001]
[9,null,null,null,null,9,null,10001]
[10,null,null,null,null,10,null,10001]
[11,null,null,null,null,11,null,10001]
[12,null,null,null,null,12,null,10001]
[13,null,null,null,null,13,null,10001]
[14,null,null,null,null,14,null,10001]
[15,null,null,null,null,"u",null,1000]
[16,null,null,null,null,"u",500]
[17,null,null,null,null,"u",500]
[18]
[19]
[20]
[21]
[22]
[23]
[24]
[25]
[26]
[27]
[28]
[29]
[30]
[31]
[32]
[33]
[34]
[35]
[36]
[37]
[38]
[39]
[40]
[41]
[42]
[43]
[44]
[45]
[46]
[47]
[48]
[49]
[50]
[51]
[52]
[53]
[54]
[55]
[56]
[57]
[58]
[59]
[60]
[61]
[62]
[63]
[64]
[65]
[66]
[67]
[68]
[69]
[70]
[71]
[72]
[73]
[74]
[75]
[76]
[77]
[78]
[79]
[80]
[81]
[82]
[83]
[84]
[85]
[86]
[87]
[88]
[89]
[90]
[91]
[92]
[93]
[94]
[95]
[96]
[97]
[98]
[99]
[100]
[101]
[102]
[103]
[104]
[105]
[106]
[107]
[108]
[109]
[110]
[111]
[112]
[113]
[114]
[115]
[116]
[{"$f":"A135+1","v":117}]
[118]
[119]
[120]
[121]
[122]
[123]
[124]
[125]
[126]
[127]
[128]
[129]
[130]
[131]
[132]
[133]
[134]
[135]
[136]
[137]
[138]
[139]
[140]
[141]
[142]
[143]
[144]
[145]
[146]
[147]
[148]
[149]
[150]
[null,null,null,null,null,"Summe:",{"$f":"ROUND(SUM(G20:G169),2)","v":71014},{"$f":"ROUND(SUM(H20:H169),2)","v":71007}]
[null,null,null,null,null,"aktuelle Veränderung",{"$f":"G170-H170","v":7}]
[]
[null,null,null,null,null,"Kontrolle",{"$f":"ROUND(SUM(D5:D11)-G170+D15,2)","v":0},{"$f":"ROUND(SUM(H5:H11)-H170+H15,2)","v":0}]
[null,null,null,null,null,"muss Null ergeben",{"$f":"IF(G173=0,\"OK\",\"Fehler\")","v":"OK"},{"$f":"IF(H173=0,\"OK\",\"Fehler\")","v":"OK"}]

{"sheet":"Kasse-Musikzug","index":8,"n_rows":174,"n_cols":12,"rows_kept":174,"cut":false,"hidden":false,"merged":[[169,2,169,4],[169,7,169,8],[167,2,167,4],[167,7,167,8],[167,9,167,11],[168,2,168,4],[168,7,168,8],[168,9,168,11],[165,2,165,4],[165,7,165,8],[165,9,165,11],[166,2,166,4],[166,7,166,8],[166,9,166,11],[163,2,163,4],[163,7,163,8],[163,9,163,11],[164,2,164,4],[164,7,164,8],[164,9,164,11],[161,2,161,4],[161,7,161,8],[161,9,161,11],[162,2,162,4],[162,7,162,8],[162,9,162,11],[159,2,159,4],[159,7,159,8],[159,9,159,11],[160,2,160,4],[160,7,160,8],[160,9,160,11],[157,2,157,4],[157,7,157,8],[157,9,157,11],[158,2,158,4],[158,7,158,8],[158,9,158,11],[155,2,155,4],[155,7,155,8],[155,9,155,11],[156,2,156,4],[156,7,156,8],[156,9,156,11],[153,2,153,4],[153,7,153,8],[153,9,153,11],[154,2,154,4],[154,7,154,8],[154,9,154,11],[151,2,151,4],[151,7,151,8],[151,9,151,11],[152,2,152,4],[152,7,152,8],[152,9,152,11],[149,2,149,4],[149,7,149,8],[149,9,149,11],[150,2,150,4],[150,7,150,8],[150,9,150,11],[147,2,147,4],[147,7,147,8],[147,9,147,11],[148,2,148,4],[148,7,148,8],[148,9,148,11],[145,2,145,4],[145,7,145,8],[145,9,145,11],[146,2,146,4],[146,7,146,8],[146,9,146,11],[143,2,143,4],[143,7,143,8],[143,9,143,11],[144,2,144,4],[144,7,144,8],[144,9,144,11],[141,2,141,4],[141,7,141,8],[141,9,141,11],[142,2,142,4],[142,7,142,8],[142,9,142,11],[139,2,139,4],[139,7,139,8],[139,9,139,11],[140,2,140,4],[140,7,140,8],[140,9,140,11],[137,2,137,4],[137,7,137,8],[137,9,137,11],[138,2,138,4],[138,7,138,8],[138,9,138,11],[135,2,135,4],[135,7,135,8],[135,9,135,11],[136,2,136,4],[136,7,136,8],[136,9,136,11],[133,2,133,4],[133,7,133,8],[133,9,133,11],[134,2,134,4],[134,7,134,8],[134,9,134,11],[131,2,131,4],[131,7,131,8],[131,9,131,11],[132,2,132,4],[132,7,132,8],[132,9,132,11],[129,2,129,4],[129,7,129,8],[129,9,129,11],[130,2,130,4],[130,7,130,8],[130,9,130,11],[127,2,127,4],[127,7,127,8],[127,9,127,11],[128,2,128,4],[128,7,128,8],[128,9,128,11],[125,2,125,4],[125,7,125,8],[125,9,125,11],[126,2,126,4],[126,7,126,8],[126,9,126,11],[123,2,123,4],[123,7,123,8],[123,9,123,11],[124,2,124,4],[124,7,124,8],[124,9,124,11],[121,2,121,4],[121,7,121,8],[121,9,121,11],[122,2,122,4],[122,7,122,8],[122,9,122,11],[119,2,119,4],[119,7,119,8],[119,9,119,11],[120,2,120,4],[120,7,120,8],[120,9,120,11],[117,2,117,4],[117,7,117,8],[117,9,117,11],[118,2,118,4],[118,7,118,8],[118,9,118,11],[115,2,115,4],[115,7,115,8],[115,9,115,11],[116,2,116,4],[116,7,116,8],[116,9,116,11],[113,2,113,4],[113,7,113,8],[113,9,113,11],[114,2,114,4],[114,7,114,8],[114,9,114,11],[111,2,111,4],[111,7,111,8],[111,9,111,11],[112,2,112,4],[112,7,112,8],[112,9,112,11],[109,2,109,4],[109,7,109,8],[109,9,109,11],[110,2,110,4],[110,7,110,8],[110,9,110,11],[107,2,107,4],[107,7,107,8],[107,9,107,11],[108,2,108,4],[108,7,108,8],[108,9,108,11],[105,2,105,4],[105,7,105,8],[105,9,105,11],[106,2,106,4],[106,7,106,8],[106,9,106,11],[103,2,103,4],[103,7,103,8],[103,9,103,11],[104,2,104,4],[104,7,104,8],[104,9,104,11],[101,2,101,4],[101,7,101,8],[101,9,101,11],[102,2,102,4],[102,7,102,8],[102,9,102,11],[99,2,99,4],[99,7,99,8],[99,9,99,11],[100,2,100,4],[100,7,100,8],[100,9,100,11],[97,2,97,4],[97,7,97,8],[97,9,97,11],[98,2,98,4],[98,7,98,8],[98,9,98,11],[95,2,95,4],[95,7,95,8],[95,9,95,11],[96,2,96,4],[96,7,96,8],[96,9,96,11],[93,2,93,4],[93,7,93,8],[93,9,93,11],[94,2,94,4],[94,7,94,8],[94,9,94,11],[91,2,91,4],[91,7,91,8],[91,9,91,11],[92,2,92,4],[92,7,92,8],[92,9,92,11],[89,2,89,4],[89,7,89,8],[89,9,89,11],[90,2,90,4],[90,7,90,8],[90,9,90,11],[87,2,87,4],[87,7,87,8],[87,9,87,11],[88,2,88,4],[88,7,88,8],[88,9,88,11],[85,2,85,4],[85,7,85,8],[85,9,85,11],[86,2,86,4],[86,7,86,8],[86,9,86,11],[83,2,83,4],[83,7,83,8],[83,9,83,11],[84,2,84,4],[84,7,84,8],[84,9,84,11],[81,2,81,4],[81,7,81,8],[81,9,81,11],[82,2,82,4],[82,7,82,8],[82,9,82,11],[79,2,79,4],[79,7,79,8],[79,9,79,11],[80,2,80,4],[80,7,80,8],[80,9,80,11],[77,2,77,4],[77,7,77,8],[77,9,77,11],[78,2,78,4],[78,7,78,8],[78,9,78,11],[75,2,75,4],[75,7,75,8],[75,9,75,11],[76,2,76,4],[76,7,76,8],[76,9,76,11],[73,2,73,4],[73,7,73,8],[73,9,73,11],[74,2,74,4],[74,7,74,8],[74,9,74,11],[71,2,71,4],[71,7,71,8],[71,9,71,11],[72,2,72,4],[72,7,72,8],[72,9,72,11],[69,2,69,4],[69,7,69,8],[69,9,69,11],[70,2,70,4],[70,7,70,8],[70,9,70,11],[67,2,67,4],[67,7,67,8],[67,9,67,11],[68,2,68,4],[68,7,68,8],[68,9,68,11],[65,2,65,4],[65,7,65,8],[65,9,65,11],[66,2,66,4],[66,7,66,8],[66,9,66,11],[63,2,63,4],[63,7,63,8],[63,9,63,11],[64,2,64,4],[64,7,64,8],[64,9,64,11],[61,2,61,4],[61,7,61,8],[61,9,61,11],[62,2,62,4],[62,7,62,8],[62,9,62,11],[59,2,59,4],[59,7,59,8],[59,9,59,11],[60,2,60,4],[60,7,60,8],[60,9,60,11],[57,2,57,4],[57,7,57,8],[57,9,57,11],[58,2,58,4],[58,7,58,8],[58,9,58,11],[55,2,55,4],[55,7,55,8],[55,9,55,11],[56,2,56,4],[56,7,56,8],[56,9,56,11],[53,2,53,4],[53,7,53,8],[53,9,53,11],[54,2,54,4],[54,7,54,8],[54,9,54,11],[51,2,51,4],[51,7,51,8],[51,9,51,11],[52,2,52,4],[52,7,52,8],[52,9,52,11],[49,2,49,4],[49,7,49,8],[49,9,49,11],[50,2,50,4],[50,7,50,8],[50,9,50,11],[47,2,47,4],[47,7,47,8],[47,9,47,11],[48,2,48,4],[48,7,48,8],[48,9,48,11],[45,2,45,4],[45,7,45,8],[45,9,45,11],[46,2,46,4],[46,7,46,8],[46,9,46,11],[43,2,43,4],[43,7,43,8],[43,9,43,11],[44,2,44,4],[44,7,44,8],[44,9,44,11],[41,2,41,4],[41,7,41,8],[41,9,41,11],[42,2,42,4],[42,7,42,8],[42,9,42,11],[39,2,39,4],[39,7,39,8],[39,9,39,11],[40,2,40,4],[40,7,40,8],[40,9,40,11],[37,2,37,4],[37,7,37,8],[37,9,37,11],[38,2,38,4],[38,7,38,8],[38,9,38,11],[35,2,35,4],[35,7,35,8],[35,9,35,11],[36,2,36,4],[36,7,36,8],[36,9,36,11],[33,2,33,4],[33,7,33,8],[33,9,33,11],[34,2,34,4],[34,7,34,8],[34,9,34,11],[31,2,31,4],[31,7,31,8],[31,9,31,11],[32,2,32,4],[32,7,32,8],[32,9,32,11],[29,2,29,4],[29,7,29,8],[29,9,29,11],[30,2,30,4],[30,7,30,8],[30,9,30,11],[21,9,21,11],[22,2,22,4],[22,7,22,8],[22,9,22,11],[27,2,27,4],[27,7,27,8],[27,9,27,11],[28,2,28,4],[28,7,28,8],[28,9,28,11],[25,2,25,4],[25,7,25,8],[25,9,25,11],[26,2,26,4],[26,7,26,8],[26,9,26,11],[0,3,0,4],[172,7,172,8],[173,7,173,8],[19,2,19,4],[19,7,19,8],[19,9,19,11],[20,2,20,4],[20,7,20,8],[20,9,20,11],[1,1,1,3],[1,4,1,6],[1,10,1,11],[18,2,18,4],[18,7,18,8],[18,9,18,11],[15,7,15,8],[23,2,23,4],[23,7,23,8],[23,9,23,11],[24,2,24,4],[24,7,24,8],[24,9,24,11],[21,2,21,4],[21,7,21,8]]}
[null,"Kasse 3","Musikzug"]
[null,{"$f":"'Gesamt-Einnahmen und Ausgaben'!A2","v":"Einnahmen- und Ausgaben für das Haushaltsjahr "},null,null,{"$f":"'Gesamt-Einnahmen und Ausgaben'!D2","v":2022},null,null,null,null,null,{"$f":"'Bankkonto-Wehr'!K2:L2","v":"Planung 2022"}]
[null,{"$f":"'Gesamt-Einnahmen und Ausgaben'!A3","v":"Nr."},{"$f":"'Gesamt-Einnahmen und Ausgaben'!B3","v":"Bezeichnung"},{"$f":"'Gesamt-Einnahmen und Ausgaben'!C3","v":"Einnahmen "},{"$f":"'Gesamt-Einnahmen und Ausgaben'!D3","v":"Erläuterungen"},{"$f":"'Gesamt-Einnahmen und Ausgaben'!E3","v":"Nr."},{"$f":"'Gesamt-Einnahmen und Ausgaben'!F3","v":"Bezeichnung"},{"$f":"'Gesamt-Einnahmen und Ausgaben'!G3","v":"Ausgaben "},{"$f":"'Gesamt-Einnahmen und Ausgaben'!H3","v":"Erläuterungen"},null,"Einnahmen ","Ausgaben "]
[null,1,2,3,4,5,6,7,8]
[null,{"$f":"'Gesamt-Einnahmen und Ausgaben'!A5","v":0},{"$f":"'Gesamt-Einnahmen und Ausgaben'!B5","v":"Zuwendungen von Mitgliedern"},{"$f":"SUMIF(F$20:F$169,B5,G$20:G$169)","v":10002},null,{"$f":"'Gesamt-Einnahmen und Ausgaben'!E5","v":8},{"$f":"'Gesamt-Einnahmen und Ausgaben'!F5","v":"Ausgaben für Kameradschaftspflege und Versammlungen"},{"$f":"SUMIF(F$20:F$169,F5,H$20:H$169)","v":10001},null,null,1000,2000]
[null,{"$f":"'Gesamt-Einnahmen und Ausgaben'!A6","v":1},{"$f":"'Gesamt-Einnahmen und Ausgaben'!B6","v":"Zuwendungen von Dritten"},10002,null,{"$f":"'Gesamt-Einnahmen und Ausgaben'!E6","v":9},{"$f":"'Gesamt-Einnahmen und Ausgaben'!F6","v":"Ausgaben für Ehrungen, Geschenke und ähnliche Anlässe"},10001,null,null,1000,1000]
[null,{"$f":"'Gesamt-Einnahmen und Ausgaben'!A7","v":2},"Einnahmen aus Veranstaltungen und Auftritten des Musikzugs",10002,null,{"$f":"'Gesamt-Einnahmen und Ausgaben'!E7","v":10},{"$f":"'Gesamt-Einnahmen und Ausgaben'!F7","v":"Ausgaben für Veranstaltungen "},10001,null,null,1000,1000]
[null,{"$f":"'Gesamt-Einnahmen und Ausgaben'!A8","v":3},{"$f":"'Gesamt-Einnahmen und Ausgaben'!B8","v":"Veräußerung von Vermögens-gegenständen im Einzelwert ab 500 € "},10002,{"$f":"'Gesamt-Einnahmen und Ausgaben'!D8","v":"Einnahmen aus Abgängen von der Bestandsliste"},{"$f":"'Gesamt-Einnahmen und Ausgaben'!E8","v":11},{"$f":"'Gesamt-Einnahmen und Ausgaben'!F8","v":"Erwerb von Vermögensgegenständen im Einzelwert ab 500 € "},10001,{"$f":"'Gesamt-Einnahmen und Ausgaben'!H8","v":"Ausgaben für Zugänge zur Bestandsliste"},null,1000,1000]
[null,{"$f":"'Gesamt-Einnahmen und Ausgaben'!A9","v":4},{"$f":"'Gesamt-Einnahmen und Ausgaben'!B9","v":"Erstattung von Auslagen durch Gemeinde und Dritte"},10002,null,{"$f":"'Gesamt-Einnahmen und Ausgaben'!E9","v":12},{"$f":"'Gesamt-Einnahmen und Ausgaben'!F9","v":"Auslagen für Gemeinde und Dritte"},10001,null,null,1000,1000]
[null,{"$f":"'Gesamt-Einnahmen und Ausgaben'!A10","v":5},{"$f":"'Gesamt-Einnahmen und Ausgaben'!B10","v":"Sonstige Einnahmen"},10002,null,{"$f":"'Gesamt-Einnahmen und Ausgaben'!E10","v":13},{"$f":"'Gesamt-Einnahmen und Ausgaben'!F10","v":"Sonstige Ausgaben"},10001,null,null,1000,1000]
[null,{"$f":"'Gesamt-Einnahmen und Ausgaben'!A11","v":6},{"$f":"'Gesamt-Einnahmen und Ausgaben'!B11","v":"Einzahlungen der Gemeinde"},10002,null,{"$f":"'Gesamt-Einnahmen und Ausgaben'!E11","v":14},{"$f":"'Gesamt-Einnahmen und Ausgaben'!F11","v":"Auszahlungen an die Gemeinde"},10001,null,null,1000,1000]
[null,{"$f":"'Gesamt-Einnahmen und Ausgaben'!A12","v":7},{"$f":"'Gesamt-Einnahmen und Ausgaben'!B12","v":"Entnahme aus der Rücklage"},{"$f":"IF((H5+H6+H7+H8+H9+H10+H11)>(D5+D6+D7+D8+D9+D10+D11),H5+H6+H7+H8+H9+H10+H11-D5-D6-D7-D8-D9-D10-D11,0)","v":0},"Automatische Buchung",{"$f":"'Gesamt-Einnahmen und Ausgaben'!E12","v":15},{"$f":"'Gesamt-Einnahmen und Ausgaben'!F12","v":"Zuführung zur Rücklage"},{"$f":"IF((H5+H6+H7+H8+H9+H10+H11)<(D5+D6+D7+D8+D9+D10+D11),D5+D6+D7+D8+D9+D10+D11-H5-H6-H7-H8-H9-H10-H11,0)","v":7},"Automatische Buchung"]
[null,{"$f":"'Gesamt-Einnahmen und Ausgaben'!A13","v":" 0-7"},{"$f":"'Gesamt-Einnahmen und Ausgaben'!B13","v":"Gesamteinnahmen"},{"$f":"SUM(D5:D12)","v":70014},null,{"$f":"'Gesamt-Einnahmen und Ausgaben'!E13","v":" 8-15"},{"$f":"'Gesamt-Einnahmen und Ausgaben'!F13","v":"Gesamtausgaben"},{"$f":"SUM(H5:H12)","v":70014}," ",null,{"$f":"SUM(K5:K12)","v":7000},{"$f":"SUM(L5:L12)","v":8000}]
[null,"© Ludwig Fink; Landesfeuerwehrverband Schleswig-Holstein",null,null,null,null,{"$f":"'Gesamt-Einnahmen und Ausgaben'!F14","v":"Die Ausgaben werden für gegenseitig deckungsfähig erklärt."}]
[null,"U","Umbuchungen zw. Konten und Kassen",{"$f":"SUMIF(F$20:F$169,B15,G$20:G$169)","v":1000},null,"U","Umbuchungen zw. Konten und Kassen",{"$f":"SUMIF(F$20:F$169,F15,H$20:H$169)","v":1000}]
["Zeilen:",{"$f":"A169","v":150},null,"Bitte Kommentar beachten",null,null,{"$f":"'Übersicht Banken u. Kassen'!D2","v":"Stand am 1. Januar gemäß Kontoauszug/ Kassenaufnahmeprotokoll"},{"$f":"'Übersicht Banken u. Kassen'!E2","v":"Aktueller Stand gemäß Buchführung"}]
[null,"Sprung zu:","Bedienungshinweise!A1",null,null,null,{"$f":"'Übersicht Banken u. Kassen'!D9","v":1},null,{"$f":"G17+G171","v":8},{"$f":"IF(I17<0,\"Fehler! Kann nicht negativ werden\",\"OK\")","v":"OK"}]
[]
["Beleg-Nr.","Datum","Bezeichnung",null,null,"Kennziffer","Einnahme/Einzahlung","Ausgabe/Auszahlung",null,"Bemerkungen"]
[1,null,null,null,null,0,10002]
[{"$f":"A20+1","v":2},null,"Bitte vor Gebrauch Kennziffern und Beträge löschen",null,null,1,10002]
[{"$f":"A21+1","v":3},null,null,null,null,2,10002]
[4,null,null,null,null,3,10002]
[5,null,null,null,null,4,10002]
[6,null,null,null,null,5,10002]
[7,null,null,null,null,6,10002]
[8,null,null,null,null,8,null,10001]
[9,null,null,null,null,9,null,10001]
[10,null,null,null,null,10,null,10001]
[11,null,null,null,null,11,null,10001]
[12,null,null,null,null,12,null,10001]
[13,null,null,null,null,13,null,10001]
[14,null,null,null,null,14,null,10001]
[15,null,null,null,null,"u",null,1000]
[16,null,null,null,null,"u",500]
[17,null,null,null,null,"u",500]
[18]
[19]
[20]
[21]
[22]
[23]
[24]
[25]
[26]
[27]
[28]
[29]
[30]
[31]
[32]
[33]
[34]
[35]
[36]
[37]
[38]
[39]
[40]
[41]
[42]
[43]
[44]
[45]
[46]
[47]
[48]
[49]
[50]
[51]
[52]
[53]
[54]
[55]
[56]
[57]
[58]
[59]
[60]
[61]
[62]
[63]
[64]
[65]
[66]
[{"$f":"A85+1","v":67}]
[68]
[69]
[70]
[71]
[72]
[73]
[74]
[75]
[76]
[77]
[78]
[79]
[80]
[81]
[82]
[83]
[84]
[85]
[86]
[87]
[88]
[89]
[90]
[91]
[92]
[93]
[94]
[95]
[96]
[97]
[98]
[99]
[100]
[101]
[102]
[103]
[104]
[105]
[106]
[107]
[108]
[109]
[110]
[111]
[112]
[113]
[114]
[115]
[116]
[117]
[118]
[119]
[120]
[121]
[122]
[123]
[124]
[125]
[126]
[127]
[128]
[129]
[130]
[{"$f":"A149+1","v":131}]
[132]
[133]
[134]
[135]
[136]
[137]
[138]
[139]
[140]
[141]
[142]
[143]
[144]
[145]
[146]
[147]
[148]
[149]
[150]
[null,null,null,null,null,"Summe:",{"$f":"ROUND(SUM(G20:G169),2)","v":71014},{"$f":"ROUND(SUM(H20:H169),2)","v":71007}]
[null,null,null,null,null,"aktuelle Veränderung",{"$f":"G170-H170","v":7}]
[]
[null,null,null,null,null,"Kontrolle",{"$f":"ROUND(SUM(D5:D11)-G170+D15,2)","v":0},{"$f":"ROUND(SUM(H5:H11)-H170+H15,2)","v":0}]
[null,null,null,null,null,"muss Null ergeben",{"$f":"IF(G173=0,\"OK\",\"Fehler\")","v":"OK"},{"$f":"IF(H173=0,\"OK\",\"Fehler\")","v":"OK"}]

{"sheet":"Kasse 4","index":9,"n_rows":174,"n_cols":12,"rows_kept":174,"cut":false,"hidden":false,"merged":[[169,2,169,4],[169,7,169,8],[167,2,167,4],[167,7,167,8],[167,9,167,11],[168,2,168,4],[168,7,168,8],[168,9,168,11],[165,2,165,4],[165,7,165,8],[165,9,165,11],[166,2,166,4],[166,7,166,8],[166,9,166,11],[163,2,163,4],[163,7,163,8],[163,9,163,11],[164,2,164,4],[164,7,164,8],[164,9,164,11],[161,2,161,4],[161,7,161,8],[161,9,161,11],[162,2,162,4],[162,7,162,8],[162,9,162,11],[159,2,159,4],[159,7,159,8],[159,9,159,11],[160,2,160,4],[160,7,160,8],[160,9,160,11],[157,2,157,4],[157,7,157,8],[157,9,157,11],[158,2,158,4],[158,7,158,8],[158,9,158,11],[155,2,155,4],[155,7,155,8],[155,9,155,11],[156,2,156,4],[156,7,156,8],[156,9,156,11],[153,2,153,4],[153,7,153,8],[153,9,153,11],[154,2,154,4],[154,7,154,8],[154,9,154,11],[151,2,151,4],[151,7,151,8],[151,9,151,11],[152,2,152,4],[152,7,152,8],[152,9,152,11],[149,2,149,4],[149,7,149,8],[149,9,149,11],[150,2,150,4],[150,7,150,8],[150,9,150,11],[147,2,147,4],[147,7,147,8],[147,9,147,11],[148,2,148,4],[148,7,148,8],[148,9,148,11],[145,2,145,4],[145,7,145,8],[145,9,145,11],[146,2,146,4],[146,7,146,8],[146,9,146,11],[143,2,143,4],[143,7,143,8],[143,9,143,11],[144,2,144,4],[144,7,144,8],[144,9,144,11],[141,2,141,4],[141,7,141,8],[141,9,141,11],[142,2,142,4],[142,7,142,8],[142,9,142,11],[139,2,139,4],[139,7,139,8],[139,9,139,11],[140,2,140,4],[140,7,140,8],[140,9,140,11],[137,2,137,4],[137,7,137,8],[137,9,137,11],[138,2,138,4],[138,7,138,8],[138,9,138,11],[135,2,135,4],[135,7,135,8],[135,9,135,11],[136,2,136,4],[136,7,136,8],[136,9,136,11],[133,2,133,4],[133,7,133,8],[133,9,133,11],[134,2,134,4],[134,7,134,8],[134,9,134,11],[131,2,131,4],[131,7,131,8],[131,9,131,11],[132,2,132,4],[132,7,132,8],[132,9,132,11],[129,2,129,4],[129,7,129,8],[129,9,129,11],[130,2,130,4],[130,7,130,8],[130,9,130,11],[127,2,127,4],[127,7,127,8],[127,9,127,11],[128,2,128,4],[128,7,128,8],[128,9,128,11],[125,2,125,4],[125,7,125,8],[125,9,125,11],[126,2,126,4],[126,7,126,8],[126,9,126,11],[123,2,123,4],[123,7,123,8],[123,9,123,11],[124,2,124,4],[124,7,124,8],[124,9,124,11],[121,2,121,4],[121,7,121,8],[121,9,121,11],[122,2,122,4],[122,7,122,8],[122,9,122,11],[119,2,119,4],[119,7,119,8],[119,9,119,11],[120,2,120,4],[120,7,120,8],[120,9,120,11],[117,2,117,4],[117,7,117,8],[117,9,117,11],[118,2,118,4],[118,7,118,8],[118,9,118,11],[115,2,115,4],[115,7,115,8],[115,9,115,11],[116,2,116,4],[116,7,116,8],[116,9,116,11],[113,2,113,4],[113,7,113,8],[113,9,113,11],[114,2,114,4],[114,7,114,8],[114,9,114,11],[111,2,111,4],[111,7,111,8],[111,9,111,11],[112,2,112,4],[112,7,112,8],[112,9,112,11],[109,2,109,4],[109,7,109,8],[109,9,109,11],[110,2,110,4],[110,7,110,8],[110,9,110,11],[107,2,107,4],[107,7,107,8],[107,9,107,11],[108,2,108,4],[108,7,108,8],[108,9,108,11],[105,2,105,4],[105,7,105,8],[105,9,105,11],[106,2,106,4],[106,7,106,8],[106,9,106,11],[103,2,103,4],[103,7,103,8],[103,9,103,11],[104,2,104,4],[104,7,104,8],[104,9,104,11],[101,2,101,4],[101,7,101,8],[101,9,101,11],[102,2,102,4],[102,7,102,8],[102,9,102,11],[99,2,99,4],[99,7,99,8],[99,9,99,11],[100,2,100,4],[100,7,100,8],[100,9,100,11],[97,2,97,4],[97,7,97,8],[97,9,97,11],[98,2,98,4],[98,7,98,8],[98,9,98,11],[95,2,95,4],[95,7,95,8],[95,9,95,11],[96,2,96,4],[96,7,96,8],[96,9,96,11],[93,2,93,4],[93,7,93,8],[93,9,93,11],[94,2,94,4],[94,7,94,8],[94,9,94,11],[91,2,91,4],[91,7,91,8],[91,9,91,11],[92,2,92,4],[92,7,92,8],[92,9,92,11],[89,2,89,4],[89,7,89,8],[89,9,89,11],[90,2,90,4],[90,7,90,8],[90,9,90,11],[87,2,87,4],[87,7,87,8],[87,9,87,11],[88,2,88,4],[88,7,88,8],[88,9,88,11],[85,2,85,4],[85,7,85,8],[85,9,85,11],[86,2,86,4],[86,7,86,8],[86,9,86,11],[83,2,83,4],[83,7,83,8],[83,9,83,11],[84,2,84,4],[84,7,84,8],[84,9,84,11],[81,2,81,4],[81,7,81,8],[81,9,81,11],[82,2,82,4],[82,7,82,8],[82,9,82,11],[79,2,79,4],[79,7,79,8],[79,9,79,11],[80,2,80,4],[80,7,80,8],[80,9,80,11],[77,2,77,4],[77,7,77,8],[77,9,77,11],[78,2,78,4],[78,7,78,8],[78,9,78,11],[75,2,75,4],[75,7,75,8],[75,9,75,11],[76,2,76,4],[76,7,76,8],[76,9,76,11],[73,2,73,4],[73,7,73,8],[73,9,73,11],[74,2,74,4],[74,7,74,8],[74,9,74,11],[71,2,71,4],[71,7,71,8],[71,9,71,11],[72,2,72,4],[72,7,72,8],[72,9,72,11],[69,2,69,4],[69,7,69,8],[69,9,69,11],[70,2,70,4],[70,7,70,8],[70,9,70,11],[67,2,67,4],[67,7,67,8],[67,9,67,11],[68,2,68,4],[68,7,68,8],[68,9,68,11],[65,2,65,4],[65,7,65,8],[65,9,65,11],[66,2,66,4],[66,7,66,8],[66,9,66,11],[63,2,63,4],[63,7,63,8],[63,9,63,11],[64,2,64,4],[64,7,64,8],[64,9,64,11],[61,2,61,4],[61,7,61,8],[61,9,61,11],[62,2,62,4],[62,7,62,8],[62,9,62,11],[59,2,59,4],[59,7,59,8],[59,9,59,11],[60,2,60,4],[60,7,60,8],[60,9,60,11],[57,2,57,4],[57,7,57,8],[57,9,57,11],[58,2,58,4],[58,7,58,8],[58,9,58,11],[55,2,55,4],[55,7,55,8],[55,9,55,11],[56,2,56,4],[56,7,56,8],[56,9,56,11],[53,2,53,4],[53,7,53,8],[53,9,53,11],[54,2,54,4],[54,7,54,8],[54,9,54,11],[51,2,51,4],[51,7,51,8],[51,9,51,11],[52,2,52,4],[52,7,52,8],[52,9,52,11],[49,2,49,4],[49,7,49,8],[49,9,49,11],[50,2,50,4],[50,7,50,8],[50,9,50,11],[47,2,47,4],[47,7,47,8],[47,9,47,11],[48,2,48,4],[48,7,48,8],[48,9,48,11],[45,2,45,4],[45,7,45,8],[45,9,45,11],[46,2,46,4],[46,7,46,8],[46,9,46,11],[43,2,43,4],[43,7,43,8],[43,9,43,11],[44,2,44,4],[44,7,44,8],[44,9,44,11],[41,2,41,4],[41,7,41,8],[41,9,41,11],[42,2,42,4],[42,7,42,8],[42,9,42,11],[39,2,39,4],[39,7,39,8],[39,9,39,11],[40,2,40,4],[40,7,40,8],[40,9,40,11],[37,2,37,4],[37,7,37,8],[37,9,37,11],[38,2,38,4],[38,7,38,8],[38,9,38,11],[35,2,35,4],[35,7,35,8],[35,9,35,11],[36,2,36,4],[36,7,36,8],[36,9,36,11],[33,2,33,4],[33,7,33,8],[33,9,33,11],[34,2,34,4],[34,7,34,8],[34,9,34,11],[31,2,31,4],[31,7,31,8],[31,9,31,11],[32,2,32,4],[32,7,32,8],[32,9,32,11],[29,2,29,4],[29,7,29,8],[29,9,29,11],[30,2,30,4],[30,7,30,8],[30,9,30,11],[21,9,21,11],[22,2,22,4],[22,7,22,8],[22,9,22,11],[27,2,27,4],[27,7,27,8],[27,9,27,11],[28,2,28,4],[28,7,28,8],[28,9,28,11],[25,2,25,4],[25,7,25,8],[25,9,25,11],[26,2,26,4],[26,7,26,8],[26,9,26,11],[0,3,0,4],[172,7,172,8],[173,7,173,8],[19,2,19,4],[19,7,19,8],[19,9,19,11],[20,2,20,4],[20,7,20,8],[20,9,20,11],[1,1,1,3],[1,4,1,6],[1,10,1,11],[18,2,18,4],[18,7,18,8],[18,9,18,11],[15,7,15,8],[23,2,23,4],[23,7,23,8],[23,9,23,11],[24,2,24,4],[24,7,24,8],[24,9,24,11],[21,2,21,4],[21,7,21,8]]}
[null,"Kasse 4","Bezeichnung hier eintragen"]
[null,{"$f":"'Gesamt-Einnahmen und Ausgaben'!A2","v":"Einnahmen- und Ausgaben für das Haushaltsjahr "},null,null,{"$f":"'Gesamt-Einnahmen und Ausgaben'!D2","v":2022},null,null,null,null,null,{"$f":"'Bankkonto-Wehr'!K2:L2","v":"Planung 2022"}]
[null,{"$f":"'Gesamt-Einnahmen und Ausgaben'!A3","v":"Nr."},{"$f":"'Gesamt-Einnahmen und Ausgaben'!B3","v":"Bezeichnung"},{"$f":"'Gesamt-Einnahmen und Ausgaben'!C3","v":"Einnahmen "},{"$f":"'Gesamt-Einnahmen und Ausgaben'!D3","v":"Erläuterungen"},{"$f":"'Gesamt-Einnahmen und Ausgaben'!E3","v":"Nr."},{"$f":"'Gesamt-Einnahmen und Ausgaben'!F3","v":"Bezeichnung"},{"$f":"'Gesamt-Einnahmen und Ausgaben'!G3","v":"Ausgaben "},{"$f":"'Gesamt-Einnahmen und Ausgaben'!H3","v":"Erläuterungen"},null,"Einnahmen ","Ausgaben "]
[null,1,2,3,4,5,6,7,8]
[null,{"$f":"'Gesamt-Einnahmen und Ausgaben'!A5","v":0},{"$f":"'Gesamt-Einnahmen und Ausgaben'!B5","v":"Zuwendungen von Mitgliedern"},{"$f":"SUMIF(F$20:F$169,B5,G$20:G$169)","v":10002},null,{"$f":"'Gesamt-Einnahmen und Ausgaben'!E5","v":8},{"$f":"'Gesamt-Einnahmen und Ausgaben'!F5","v":"Ausgaben für Kameradschaftspflege und Versammlungen"},{"$f":"SUMIF(F$20:F$169,F5,H$20:H$169)","v":10001},null,null,1000,2000]
[null,{"$f":"'Gesamt-Einnahmen und Ausgaben'!A6","v":1},{"$f":"'Gesamt-Einnahmen und Ausgaben'!B6","v":"Zuwendungen von Dritten"},10002,null,{"$f":"'Gesamt-Einnahmen und Ausgaben'!E6","v":9},{"$f":"'Gesamt-Einnahmen und Ausgaben'!F6","v":"Ausgaben für Ehrungen, Geschenke und ähnliche Anlässe"},10001,null,null,1000,1000]
[null,{"$f":"'Gesamt-Einnahmen und Ausgaben'!A7","v":2},{"$f":"'Gesamt-Einnahmen und Ausgaben'!B7","v":"Einnahmen aus Veranstaltungen "},10002,null,{"$f":"'Gesamt-Einnahmen und Ausgaben'!E7","v":10},{"$f":"'Gesamt-Einnahmen und Ausgaben'!F7","v":"Ausgaben für Veranstaltungen "},10001,null,null,1000,1000]
[null,{"$f":"'Gesamt-Einnahmen und Ausgaben'!A8","v":3},{"$f":"'Gesamt-Einnahmen und Ausgaben'!B8","v":"Veräußerung von Vermögens-gegenständen im Einzelwert ab 500 € "},10002,{"$f":"'Gesamt-Einnahmen und Ausgaben'!D8","v":"Einnahmen aus Abgängen von der Bestandsliste"},{"$f":"'Gesamt-Einnahmen und Ausgaben'!E8","v":11},{"$f":"'Gesamt-Einnahmen und Ausgaben'!F8","v":"Erwerb von Vermögensgegenständen im Einzelwert ab 500 € "},10001,{"$f":"'Gesamt-Einnahmen und Ausgaben'!H8","v":"Ausgaben für Zugänge zur Bestandsliste"},null,1000,1000]
[null,{"$f":"'Gesamt-Einnahmen und Ausgaben'!A9","v":4},{"$f":"'Gesamt-Einnahmen und Ausgaben'!B9","v":"Erstattung von Auslagen durch Gemeinde und Dritte"},10002,null,{"$f":"'Gesamt-Einnahmen und Ausgaben'!E9","v":12},{"$f":"'Gesamt-Einnahmen und Ausgaben'!F9","v":"Auslagen für Gemeinde und Dritte"},10001,null,null,1000,1000]
[null,{"$f":"'Gesamt-Einnahmen und Ausgaben'!A10","v":5},{"$f":"'Gesamt-Einnahmen und Ausgaben'!B10","v":"Sonstige Einnahmen"},10002,null,{"$f":"'Gesamt-Einnahmen und Ausgaben'!E10","v":13},{"$f":"'Gesamt-Einnahmen und Ausgaben'!F10","v":"Sonstige Ausgaben"},10001,null,null,1000,1000]
[null,{"$f":"'Gesamt-Einnahmen und Ausgaben'!A11","v":6},{"$f":"'Gesamt-Einnahmen und Ausgaben'!B11","v":"Einzahlungen der Gemeinde"},10002,null,{"$f":"'Gesamt-Einnahmen und Ausgaben'!E11","v":14},{"$f":"'Gesamt-Einnahmen und Ausgaben'!F11","v":"Auszahlungen an die Gemeinde"},10001,null,null,1000,1000]
[null,{"$f":"'Gesamt-Einnahmen und Ausgaben'!A12","v":7},{"$f":"'Gesamt-Einnahmen und Ausgaben'!B12","v":"Entnahme aus der Rücklage"},{"$f":"IF((H5+H6+H7+H8+H9+H10+H11)>(D5+D6+D7+D8+D9+D10+D11),H5+H6+H7+H8+H9+H10+H11-D5-D6-D7-D8-D9-D10-D11,0)","v":0},"Automatische Buchung",{"$f":"'Gesamt-Einnahmen und Ausgaben'!E12","v":15},{"$f":"'Gesamt-Einnahmen und Ausgaben'!F12","v":"Zuführung zur Rücklage"},{"$f":"IF((H5+H6+H7+H8+H9+H10+H11)<(D5+D6+D7+D8+D9+D10+D11),D5+D6+D7+D8+D9+D10+D11-H5-H6-H7-H8-H9-H10-H11,0)","v":7},"Automatische Buchung"]
[null,{"$f":"'Gesamt-Einnahmen und Ausgaben'!A13","v":" 0-7"},{"$f":"'Gesamt-Einnahmen und Ausgaben'!B13","v":"Gesamteinnahmen"},{"$f":"SUM(D5:D12)","v":70014},null,{"$f":"'Gesamt-Einnahmen und Ausgaben'!E13","v":" 8-15"},{"$f":"'Gesamt-Einnahmen und Ausgaben'!F13","v":"Gesamtausgaben"},{"$f":"SUM(H5:H12)","v":70014}," ",null,{"$f":"SUM(K5:K12)","v":7000},{"$f":"SUM(L5:L12)","v":8000}]
[null,"© Ludwig Fink; Landesfeuerwehrverband Schleswig-Holstein",null,null,null,null,{"$f":"'Gesamt-Einnahmen und Ausgaben'!F14","v":"Die Ausgaben werden für gegenseitig deckungsfähig erklärt."}]
[null,"U","Umbuchungen zw. Konten und Kassen",{"$f":"SUMIF(F$20:F$169,B15,G$20:G$169)","v":1000},null,"U","Umbuchungen zw. Konten und Kassen",{"$f":"SUMIF(F$20:F$169,F15,H$20:H$169)","v":1000}]
["Zeilen:",{"$f":"A169","v":150},null,"Bitte Kommentar beachten",null,null,{"$f":"'Übersicht Banken u. Kassen'!D2","v":"Stand am 1. Januar gemäß Kontoauszug/ Kassenaufnahmeprotokoll"},{"$f":"'Übersicht Banken u. Kassen'!E2","v":"Aktueller Stand gemäß Buchführung"}]
[null,"Sprung zu:","Bedienungshinweise!A1",null,null,null,{"$f":"'Übersicht Banken u. Kassen'!D10","v":1},null,{"$f":"G17+G171","v":8},{"$f":"IF(I17<0,\"Fehler! Kann nicht negativ werden\",\"OK\")","v":"OK"}]
[]
["Beleg-Nr.","Datum","Bezeichnung",null,null,"Kennziffer","Einnahme/Einzahlung","Ausgabe/Auszahlung",null,"Bemerkungen"]
[1,null,null,null,null,0,10002]
[{"$f":"A20+1","v":2},null,"Bitte vor Gebrauch Kennziffern und Beträge löschen",null,null,1,10002]
[{"$f":"A21+1","v":3},null,null,null,null,2,10002]
[4,null,null,null,null,3,10002]
[5,null,null,null,null,4,10002]
[6,null,null,null,null,5,10002]
[7,null,null,null,null,6,10002]
[8,null,null,null,null,8,null,10001]
[9,null,null,null,null,9,null,10001]
[10,null,null,null,null,10,null,10001]
[11,null,null,null,null,11,null,10001]
[12,null,null,null,null,12,null,10001]
[13,null,null,null,null,13,null,10001]
[14,null,null,null,null,14,null,10001]
[15,null,null,null,null,"u",null,1000]
[16,null,null,null,null,"u",500]
[17,null,null,null,null,"u",500]
[18]
[19]
[20]
[21]
[22]
[23]
[24]
[25]
[26]
[27]
[28]
[29]
[30]
[31]
[32]
[33]
[34]
[35]
[36]
[37]
[38]
[39]
[40]
[41]
[42]
[43]
[44]
[45]
[46]
[47]
[48]
[49]
[50]
[51]
[52]
[53]
[54]
[55]
[56]
[57]
[58]
[59]
[60]
[61]
[62]
[63]
[64]
[65]
[66]
[{"$f":"A85+1","v":67}]
[68]
[69]
[70]
[71]
[72]
[73]
[74]
[75]
[76]
[77]
[78]
[79]
[80]
[81]
[82]
[83]
[84]
[85]
[86]
[87]
[88]
[89]
[90]
[91]
[92]
[93]
[94]
[95]
[96]
[97]
[98]
[99]
[100]
[101]
[102]
[103]
[104]
[105]
[106]
[107]
[108]
[109]
[110]
[111]
[112]
[113]
[114]
[115]
[116]
[117]
[118]
[119]
[120]
[121]
[122]
[123]
[124]
[125]
[126]
[127]
[128]
[129]
[130]
[{"$f":"A149+1","v":131}]
[132]
[133]
[134]
[135]
[136]
[137]
[138]
[139]
[140]
[141]
[142]
[143]
[144]
[145]
[146]
[147]
[148]
[149]
[150]
[null,null,null,null,null,"Summe:",{"$f":"ROUND(SUM(G20:G169),2)","v":71014},{"$f":"ROUND(SUM(H20:H169),2)","v":71007}]
[null,null,null,null,null,"aktuelle Veränderung",{"$f":"G170-H170","v":7}]
[]
[null,null,null,null,null,"Kontrolle",{"$f":"ROUND(SUM(D5:D11)-G170+D15,2)","v":0},{"$f":"ROUND(SUM(H5:H11)-H170+H15,2)","v":0}]
[null,null,null,null,null,"muss Null ergeben",{"$f":"IF(G173=0,\"OK\",\"Fehler\")","v":"OK"},{"$f":"IF(H173=0,\"OK\",\"Fehler\")","v":"OK"}]

{"sheet":"Kasse 5","index":10,"n_rows":174,"n_cols":12,"rows_kept":174,"cut":false,"hidden":false,"merged":[[169,2,169,4],[169,7,169,8],[167,2,167,4],[167,7,167,8],[167,9,167,11],[168,2,168,4],[168,7,168,8],[168,9,168,11],[165,2,165,4],[165,7,165,8],[165,9,165,11],[166,2,166,4],[166,7,166,8],[166,9,166,11],[163,2,163,4],[163,7,163,8],[163,9,163,11],[164,2,164,4],[164,7,164,8],[164,9,164,11],[161,2,161,4],[161,7,161,8],[161,9,161,11],[162,2,162,4],[162,7,162,8],[162,9,162,11],[159,2,159,4],[159,7,159,8],[159,9,159,11],[160,2,160,4],[160,7,160,8],[160,9,160,11],[157,2,157,4],[157,7,157,8],[157,9,157,11],[158,2,158,4],[158,7,158,8],[158,9,158,11],[155,2,155,4],[155,7,155,8],[155,9,155,11],[156,2,156,4],[156,7,156,8],[156,9,156,11],[153,2,153,4],[153,7,153,8],[153,9,153,11],[154,2,154,4],[154,7,154,8],[154,9,154,11],[151,2,151,4],[151,7,151,8],[151,9,151,11],[152,2,152,4],[152,7,152,8],[152,9,152,11],[149,2,149,4],[149,7,149,8],[149,9,149,11],[150,2,150,4],[150,7,150,8],[150,9,150,11],[147,2,147,4],[147,7,147,8],[147,9,147,11],[148,2,148,4],[148,7,148,8],[148,9,148,11],[145,2,145,4],[145,7,145,8],[145,9,145,11],[146,2,146,4],[146,7,146,8],[146,9,146,11],[143,2,143,4],[143,7,143,8],[143,9,143,11],[144,2,144,4],[144,7,144,8],[144,9,144,11],[141,2,141,4],[141,7,141,8],[141,9,141,11],[142,2,142,4],[142,7,142,8],[142,9,142,11],[139,2,139,4],[139,7,139,8],[139,9,139,11],[140,2,140,4],[140,7,140,8],[140,9,140,11],[137,2,137,4],[137,7,137,8],[137,9,137,11],[138,2,138,4],[138,7,138,8],[138,9,138,11],[135,2,135,4],[135,7,135,8],[135,9,135,11],[136,2,136,4],[136,7,136,8],[136,9,136,11],[133,2,133,4],[133,7,133,8],[133,9,133,11],[134,2,134,4],[134,7,134,8],[134,9,134,11],[131,2,131,4],[131,7,131,8],[131,9,131,11],[132,2,132,4],[132,7,132,8],[132,9,132,11],[129,2,129,4],[129,7,129,8],[129,9,129,11],[130,2,130,4],[130,7,130,8],[130,9,130,11],[127,2,127,4],[127,7,127,8],[127,9,127,11],[128,2,128,4],[128,7,128,8],[128,9,128,11],[125,2,125,4],[125,7,125,8],[125,9,125,11],[126,2,126,4],[126,7,126,8],[126,9,126,11],[123,2,123,4],[123,7,123,8],[123,9,123,11],[124,2,124,4],[124,7,124,8],[124,9,124,11],[121,2,121,4],[121,7,121,8],[121,9,121,11],[122,2,122,4],[122,7,122,8],[122,9,122,11],[119,2,119,4],[119,7,119,8],[119,9,119,11],[120,2,120,4],[120,7,120,8],[120,9,120,11],[117,2,117,4],[117,7,117,8],[117,9,117,11],[118,2,118,4],[118,7,118,8],[118,9,118,11],[115,2,115,4],[115,7,115,8],[115,9,115,11],[116,2,116,4],[116,7,116,8],[116,9,116,11],[113,2,113,4],[113,7,113,8],[113,9,113,11],[114,2,114,4],[114,7,114,8],[114,9,114,11],[111,2,111,4],[111,7,111,8],[111,9,111,11],[112,2,112,4],[112,7,112,8],[112,9,112,11],[109,2,109,4],[109,7,109,8],[109,9,109,11],[110,2,110,4],[110,7,110,8],[110,9,110,11],[107,2,107,4],[107,7,107,8],[107,9,107,11],[108,2,108,4],[108,7,108,8],[108,9,108,11],[105,2,105,4],[105,7,105,8],[105,9,105,11],[106,2,106,4],[106,7,106,8],[106,9,106,11],[103,2,103,4],[103,7,103,8],[103,9,103,11],[104,2,104,4],[104,7,104,8],[104,9,104,11],[101,2,101,4],[101,7,101,8],[101,9,101,11],[102,2,102,4],[102,7,102,8],[102,9,102,11],[99,2,99,4],[99,7,99,8],[99,9,99,11],[100,2,100,4],[100,7,100,8],[100,9,100,11],[97,2,97,4],[97,7,97,8],[97,9,97,11],[98,2,98,4],[98,7,98,8],[98,9,98,11],[95,2,95,4],[95,7,95,8],[95,9,95,11],[96,2,96,4],[96,7,96,8],[96,9,96,11],[93,2,93,4],[93,7,93,8],[93,9,93,11],[94,2,94,4],[94,7,94,8],[94,9,94,11],[91,2,91,4],[91,7,91,8],[91,9,91,11],[92,2,92,4],[92,7,92,8],[92,9,92,11],[89,2,89,4],[89,7,89,8],[89,9,89,11],[90,2,90,4],[90,7,90,8],[90,9,90,11],[87,2,87,4],[87,7,87,8],[87,9,87,11],[88,2,88,4],[88,7,88,8],[88,9,88,11],[85,2,85,4],[85,7,85,8],[85,9,85,11],[86,2,86,4],[86,7,86,8],[86,9,86,11],[83,2,83,4],[83,7,83,8],[83,9,83,11],[84,2,84,4],[84,7,84,8],[84,9,84,11],[81,2,81,4],[81,7,81,8],[81,9,81,11],[82,2,82,4],[82,7,82,8],[82,9,82,11],[79,2,79,4],[79,7,79,8],[79,9,79,11],[80,2,80,4],[80,7,80,8],[80,9,80,11],[77,2,77,4],[77,7,77,8],[77,9,77,11],[78,2,78,4],[78,7,78,8],[78,9,78,11],[75,2,75,4],[75,7,75,8],[75,9,75,11],[76,2,76,4],[76,7,76,8],[76,9,76,11],[73,2,73,4],[73,7,73,8],[73,9,73,11],[74,2,74,4],[74,7,74,8],[74,9,74,11],[71,2,71,4],[71,7,71,8],[71,9,71,11],[72,2,72,4],[72,7,72,8],[72,9,72,11],[69,2,69,4],[69,7,69,8],[69,9,69,11],[70,2,70,4],[70,7,70,8],[70,9,70,11],[67,2,67,4],[67,7,67,8],[67,9,67,11],[68,2,68,4],[68,7,68,8],[68,9,68,11],[65,2,65,4],[65,7,65,8],[65,9,65,11],[66,2,66,4],[66,7,66,8],[66,9,66,11],[63,2,63,4],[63,7,63,8],[63,9,63,11],[64,2,64,4],[64,7,64,8],[64,9,64,11],[61,2,61,4],[61,7,61,8],[61,9,61,11],[62,2,62,4],[62,7,62,8],[62,9,62,11],[59,2,59,4],[59,7,59,8],[59,9,59,11],[60,2,60,4],[60,7,60,8],[60,9,60,11],[57,2,57,4],[57,7,57,8],[57,9,57,11],[58,2,58,4],[58,7,58,8],[58,9,58,11],[55,2,55,4],[55,7,55,8],[55,9,55,11],[56,2,56,4],[56,7,56,8],[56,9,56,11],[53,2,53,4],[53,7,53,8],[53,9,53,11],[54,2,54,4],[54,7,54,8],[54,9,54,11],[51,2,51,4],[51,7,51,8],[51,9,51,11],[52,2,52,4],[52,7,52,8],[52,9,52,11],[49,2,49,4],[49,7,49,8],[49,9,49,11],[50,2,50,4],[50,7,50,8],[50,9,50,11],[47,2,47,4],[47,7,47,8],[47,9,47,11],[48,2,48,4],[48,7,48,8],[48,9,48,11],[45,2,45,4],[45,7,45,8],[45,9,45,11],[46,2,46,4],[46,7,46,8],[46,9,46,11],[43,2,43,4],[43,7,43,8],[43,9,43,11],[44,2,44,4],[44,7,44,8],[44,9,44,11],[41,2,41,4],[41,7,41,8],[41,9,41,11],[42,2,42,4],[42,7,42,8],[42,9,42,11],[39,2,39,4],[39,7,39,8],[39,9,39,11],[40,2,40,4],[40,7,40,8],[40,9,40,11],[37,2,37,4],[37,7,37,8],[37,9,37,11],[38,2,38,4],[38,7,38,8],[38,9,38,11],[35,2,35,4],[35,7,35,8],[35,9,35,11],[36,2,36,4],[36,7,36,8],[36,9,36,11],[33,2,33,4],[33,7,33,8],[33,9,33,11],[34,2,34,4],[34,7,34,8],[34,9,34,11],[31,2,31,4],[31,7,31,8],[31,9,31,11],[32,2,32,4],[32,7,32,8],[32,9,32,11],[29,2,29,4],[29,7,29,8],[29,9,29,11],[30,2,30,4],[30,7,30,8],[30,9,30,11],[21,9,21,11],[22,2,22,4],[22,7,22,8],[22,9,22,11],[27,2,27,4],[27,7,27,8],[27,9,27,11],[28,2,28,4],[28,7,28,8],[28,9,28,11],[25,2,25,4],[25,7,25,8],[25,9,25,11],[26,2,26,4],[26,7,26,8],[26,9,26,11],[0,2,0,3],[172,7,172,8],[173,7,173,8],[19,2,19,4],[19,7,19,8],[19,9,19,11],[20,2,20,4],[20,7,20,8],[20,9,20,11],[1,1,1,3],[1,4,1,6],[1,10,1,11],[18,2,18,4],[18,7,18,8],[18,9,18,11],[15,7,15,8],[23,2,23,4],[23,7,23,8],[23,9,23,11],[24,2,24,4],[24,7,24,8],[24,9,24,11],[21,2,21,4],[21,7,21,8]]}
[null,"Kasse 5","Bezeichnung hier eintragen"]
[null,{"$f":"'Gesamt-Einnahmen und Ausgaben'!A2","v":"Einnahmen- und Ausgaben für das Haushaltsjahr "},null,null,{"$f":"'Gesamt-Einnahmen und Ausgaben'!D2","v":2022},null,null,null,null,null,{"$f":"'Bankkonto-Wehr'!K2:L2","v":"Planung 2022"}]
[null,{"$f":"'Gesamt-Einnahmen und Ausgaben'!A3","v":"Nr."},{"$f":"'Gesamt-Einnahmen und Ausgaben'!B3","v":"Bezeichnung"},{"$f":"'Gesamt-Einnahmen und Ausgaben'!C3","v":"Einnahmen "},{"$f":"'Gesamt-Einnahmen und Ausgaben'!D3","v":"Erläuterungen"},{"$f":"'Gesamt-Einnahmen und Ausgaben'!E3","v":"Nr."},{"$f":"'Gesamt-Einnahmen und Ausgaben'!F3","v":"Bezeichnung"},{"$f":"'Gesamt-Einnahmen und Ausgaben'!G3","v":"Ausgaben "},{"$f":"'Gesamt-Einnahmen und Ausgaben'!H3","v":"Erläuterungen"},null,"Einnahmen ","Ausgaben "]
[null,1,2,3,4,5,6,7,8]
[null,{"$f":"'Gesamt-Einnahmen und Ausgaben'!A5","v":0},{"$f":"'Gesamt-Einnahmen und Ausgaben'!B5","v":"Zuwendungen von Mitgliedern"},{"$f":"SUMIF(F$20:F$169,B5,G$20:G$169)","v":2},null,{"$f":"'Gesamt-Einnahmen und Ausgaben'!E5","v":8},{"$f":"'Gesamt-Einnahmen und Ausgaben'!F5","v":"Ausgaben für Kameradschaftspflege und Versammlungen"},{"$f":"SUMIF(F$20:F$169,F5,H$20:H$169)","v":8},null,null,1000,2000]
[null,{"$f":"'Gesamt-Einnahmen und Ausgaben'!A6","v":1},{"$f":"'Gesamt-Einnahmen und Ausgaben'!B6","v":"Zuwendungen von Dritten"},2,null,{"$f":"'Gesamt-Einnahmen und Ausgaben'!E6","v":9},{"$f":"'Gesamt-Einnahmen und Ausgaben'!F6","v":"Ausgaben für Ehrungen, Geschenke und ähnliche Anlässe"},1,null,null,1000,1000]
[null,{"$f":"'Gesamt-Einnahmen und Ausgaben'!A7","v":2},{"$f":"'Gesamt-Einnahmen und Ausgaben'!B7","v":"Einnahmen aus Veranstaltungen "},2,null,{"$f":"'Gesamt-Einnahmen und Ausgaben'!E7","v":10},{"$f":"'Gesamt-Einnahmen und Ausgaben'!F7","v":"Ausgaben für Veranstaltungen "},1,null,null,1000,1000]
[null,{"$f":"'Gesamt-Einnahmen und Ausgaben'!A8","v":3},{"$f":"'Gesamt-Einnahmen und Ausgaben'!B8","v":"Veräußerung von Vermögens-gegenständen im Einzelwert ab 500 € "},2,{"$f":"'Gesamt-Einnahmen und Ausgaben'!D8","v":"Einnahmen aus Abgängen von der Bestandsliste"},{"$f":"'Gesamt-Einnahmen und Ausgaben'!E8","v":11},{"$f":"'Gesamt-Einnahmen und Ausgaben'!F8","v":"Erwerb von Vermögensgegenständen im Einzelwert ab 500 € "},1,{"$f":"'Gesamt-Einnahmen und Ausgaben'!H8","v":"Ausgaben für Zugänge zur Bestandsliste"},null,1000,1000]
[null,{"$f":"'Gesamt-Einnahmen und Ausgaben'!A9","v":4},{"$f":"'Gesamt-Einnahmen und Ausgaben'!B9","v":"Erstattung von Auslagen durch Gemeinde und Dritte"},2,null,{"$f":"'Gesamt-Einnahmen und Ausgaben'!E9","v":12},{"$f":"'Gesamt-Einnahmen und Ausgaben'!F9","v":"Auslagen für Gemeinde und Dritte"},1,null,null,1000,1000]
[null,{"$f":"'Gesamt-Einnahmen und Ausgaben'!A10","v":5},{"$f":"'Gesamt-Einnahmen und Ausgaben'!B10","v":"Sonstige Einnahmen"},2,null,{"$f":"'Gesamt-Einnahmen und Ausgaben'!E10","v":13},{"$f":"'Gesamt-Einnahmen und Ausgaben'!F10","v":"Sonstige Ausgaben"},1,null,null,1000,1000]
[null,{"$f":"'Gesamt-Einnahmen und Ausgaben'!A11","v":6},{"$f":"'Gesamt-Einnahmen und Ausgaben'!B11","v":"Einzahlungen der Gemeinde"},2,null,{"$f":"'Gesamt-Einnahmen und Ausgaben'!E11","v":14},{"$f":"'Gesamt-Einnahmen und Ausgaben'!F11","v":"Auszahlungen an die Gemeinde"},1,null,null,1000,1000]
[null,{"$f":"'Gesamt-Einnahmen und Ausgaben'!A12","v":7},{"$f":"'Gesamt-Einnahmen und Ausgaben'!B12","v":"Entnahme aus der Rücklage"},{"$f":"IF((H5+H6+H7+H8+H9+H10+H11)>(D5+D6+D7+D8+D9+D10+D11),H5+H6+H7+H8+H9+H10+H11-D5-D6-D7-D8-D9-D10-D11,0)","v":0},"Automatische Buchung",{"$f":"'Gesamt-Einnahmen und Ausgaben'!E12","v":15},{"$f":"'Gesamt-Einnahmen und Ausgaben'!F12","v":"Zuführung zur Rücklage"},{"$f":"IF((H5+H6+H7+H8+H9+H10+H11)<(D5+D6+D7+D8+D9+D10+D11),D5+D6+D7+D8+D9+D10+D11-H5-H6-H7-H8-H9-H10-H11,0)","v":0},"Automatische Buchung"]
[null,{"$f":"'Gesamt-Einnahmen und Ausgaben'!A13","v":" 0-7"},{"$f":"'Gesamt-Einnahmen und Ausgaben'!B13","v":"Gesamteinnahmen"},{"$f":"SUM(D5:D12)","v":14},null,{"$f":"'Gesamt-Einnahmen und Ausgaben'!E13","v":" 8-15"},{"$f":"'Gesamt-Einnahmen und Ausgaben'!F13","v":"Gesamtausgaben"},{"$f":"SUM(H5:H12)","v":14}," ",null,{"$f":"SUM(K5:K12)","v":7000},{"$f":"SUM(L5:L12)","v":8000}]
[null,"© Ludwig Fink; Landesfeuerwehrverband Schleswig-Holstein",null,null,null,null,{"$f":"'Gesamt-Einnahmen und Ausgaben'!F14","v":"Die Ausgaben werden für gegenseitig deckungsfähig erklärt."}]
[null,"U","Umbuchungen zw. Konten und Kassen",{"$f":"SUMIF(F$20:F$169,B15,G$20:G$169)","v":0},null,"U","Umbuchungen zw. Konten und Kassen",{"$f":"SUMIF(F$20:F$169,F15,H$20:H$169)","v":0}]
["Zeilen:",{"$f":"A169","v":150},null,"Bitte Kommentar beachten",null,null,{"$f":"'Übersicht Banken u. Kassen'!D2","v":"Stand am 1. Januar gemäß Kontoauszug/ Kassenaufnahmeprotokoll"},{"$f":"'Übersicht Banken u. Kassen'!E2","v":"Aktueller Stand gemäß Buchführung"}]
[null,"Sprung zu:","Bedienungshinweise!A1",null,null,null,{"$f":"'Übersicht Banken u. Kassen'!D11","v":1},null,{"$f":"G17+G171","v":1},{"$f":"IF(I17<0,\"Fehler! Kann nicht negativ werden\",\"OK\")","v":"OK"}]
[]
["Beleg-Nr.","Datum","Bezeichnung",null,null,"Kennziffer","Einnahme/Einzahlung","Ausgabe/Auszahlung",null,"Bemerkungen"]
[1,null,null,null,null,0,2]
[{"$f":"A20+1","v":2},null,null,null,null,1,2]
[{"$f":"A21+1","v":3},null,null,null,null,2,2]
[4,null,null,null,null,3,2]
[5,null,null,null,null,4,2]
[6,null,null,null,null,5,2]
[7,null,null,null,null,6,2]
[8,null,null,null,null,8,null,1]
[9,null,null,null,null,9,null,1]
[10,null,null,null,null,10,null,1]
[11,null,null,null,null,11,null,1]
[12,null,null,null,null,12,null,1]
[13,null,null,null,null,13,null,1]
[14,null,null,null,null,14,null,1]
[15,null,null,null,null,8,null,7]
[16]
[17]
[18]
[19]
[20]
[21]
[22]
[23]
[24]
[25]
[26]
[27]
[28]
[29]
[30]
[31]
[32]
[33]
[34]
[35]
[36]
[37]
[38]
[39]
[40]
[41]
[42]
[43]
[44]
[45]
[46]
[47]
[48]
[49]
[50]
[51]
[52]
[53]
[54]
[55]
[56]
[57]
[58]
[59]
[60]
[61]
[62]
[63]
[64]
[65]
[66]
[{"$f":"A85+1","v":67}]
[68]
[69]
[70]
[71]
[72]
[73]
[74]
[75]
[76]
[77]
[78]
[79]
[80]
[81]
[82]
[83]
[84]
[85]
[86]
[87]
[88]
[89]
[90]
[91]
[92]
[93]
[94]
[95]
[96]
[97]
[98]
[99]
[100]
[101]
[102]
[103]
[104]
[105]
[106]
[107]
[108]
[109]
[110]
[111]
[112]
[113]
[114]
[115]
[116]
[117]
[118]
[119]
[120]
[121]
[122]
[123]
[124]
[125]
[126]
[127]
[128]
[129]
[130]
[{"$f":"A149+1","v":131}]
[132]
[133]
[134]
[135]
[136]
[137]
[138]
[139]
[140]
[141]
[142]
[143]
[144]
[145]
[146]
[147]
[148]
[149]
[150]
[null,null,null,null,null,"Summe:",{"$f":"ROUND(SUM(G20:G169),2)","v":14},{"$f":"ROUND(SUM(H20:H169),2)","v":14}]
[null,null,null,null,null,"aktuelle Veränderung",{"$f":"G170-H170","v":0}]
[]
[null,null,null,null,null,"Kontrolle",{"$f":"ROUND(SUM(D5:D11)-G170+D15,2)","v":0},{"$f":"ROUND(SUM(H5:H11)-H170+H15,2)","v":0}]
[null,null,null,null,null,"muss Null ergeben",{"$f":"IF(G173=0,\"OK\",\"Fehler\")","v":"OK"},{"$f":"IF(H173=0,\"OK\",\"Fehler\")","v":"OK"}]

{"sheet":"Gesamt-Planung","index":11,"n_rows":103,"n_cols":8,"rows_kept":103,"cut":false,"hidden":false,"merged":[[1,4,1,6],[0,0,0,5],[1,0,1,3]]}
[{"$f":"'Gesamt-Einnahmen und Ausgaben'!A1","v":"Sondervermögen Kameradschaftskasse der Freiwilligen Feuerwehr der Gemeinde Musterort"}]
["Einnahmen- und Ausgabenplanung für das Haushaltsjahr ",null,null,null,2022]
[null,"Gesamtplan"]
[{"$f":"'Gesamt-Einnahmen und Ausgaben'!A3","v":"Nr."},{"$f":"'Gesamt-Einnahmen und Ausgaben'!B3","v":"Bezeichnung"},{"$f":"'Gesamt-Einnahmen und Ausgaben'!C3","v":"Einnahmen "},{"$f":"'Gesamt-Einnahmen und Ausgaben'!D3","v":"Erläuterungen"},{"$f":"'Gesamt-Einnahmen und Ausgaben'!E3","v":"Nr."},{"$f":"'Gesamt-Einnahmen und Ausgaben'!F3","v":"Bezeichnung"},{"$f":"'Gesamt-Einnahmen und Ausgaben'!G3","v":"Ausgaben "},{"$f":"'Gesamt-Einnahmen und Ausgaben'!H3","v":"Erläuterungen"}]
[1,2,3,4,5,6,7,8]
[{"$f":"'Gesamt-Einnahmen und Ausgaben'!A5","v":0},{"$f":"'Gesamt-Einnahmen und Ausgaben'!B5","v":"Zuwendungen von Mitgliedern"},{"$f":"'Bankkonto-Wehr'!K5+'Kasse-Wehr'!K5+'Bankkonto-Jugendwehr'!K5+'Kasse-Jugendwehr'!K5+'Bankkonto-Musikzug'!K5+'Kasse-Musikzug'!K5+'Kasse 4'!K5+'Kasse 5'!K5","v":8000},null,{"$f":"'Gesamt-Einnahmen und Ausgaben'!E5","v":8},{"$f":"'Gesamt-Einnahmen und Ausgaben'!F5","v":"Ausgaben für Kameradschaftspflege und Versammlungen"},{"$f":"'Bankkonto-Wehr'!L5+'Kasse-Wehr'!L5+'Bankkonto-Jugendwehr'!L5+'Kasse-Jugendwehr'!L5+'Bankkonto-Musikzug'!L5+'Kasse-Musikzug'!L5+'Kasse 4'!L5+'Kasse 5'!L5","v":16000}]
[{"$f":"'Gesamt-Einnahmen und Ausgaben'!A6","v":1},{"$f":"'Gesamt-Einnahmen und Ausgaben'!B6","v":"Zuwendungen von Dritten"},{"$f":"'Bankkonto-Wehr'!K6+'Kasse-Wehr'!K6+'Bankkonto-Jugendwehr'!K6+'Kasse-Jugendwehr'!K6+'Bankkonto-Musikzug'!K6+'Kasse-Musikzug'!K6+'Kasse 4'!K6+'Kasse 5'!K6","v":8000},null,{"$f":"'Gesamt-Einnahmen und Ausgaben'!E6","v":9},{"$f":"'Gesamt-Einnahmen und Ausgaben'!F6","v":"Ausgaben für Ehrungen, Geschenke und ähnliche Anlässe"},{"$f":"'Bankkonto-Wehr'!L6+'Kasse-Wehr'!L6+'Bankkonto-Jugendwehr'!L6+'Kasse-Jugendwehr'!L6+'Bankkonto-Musikzug'!L6+'Kasse-Musikzug'!L6+'Kasse 4'!L6+'Kasse 5'!L6","v":8000}]
[{"$f":"'Gesamt-Einnahmen und Ausgaben'!A7","v":2},{"$f":"'Gesamt-Einnahmen und Ausgaben'!B7","v":"Einnahmen aus Veranstaltungen "},{"$f":"'Bankkonto-Wehr'!K7+'Kasse-Wehr'!K7+'Bankkonto-Jugendwehr'!K7+'Kasse-Jugendwehr'!K7+'Bankkonto-Musikzug'!K7+'Kasse-Musikzug'!K7+'Kasse 4'!K7+'Kasse 5'!K7","v":8000},null,{"$f":"'Gesamt-Einnahmen und Ausgaben'!E7","v":10},{"$f":"'Gesamt-Einnahmen und Ausgaben'!F7","v":"Ausgaben für Veranstaltungen "},{"$f":"'Bankkonto-Wehr'!L7+'Kasse-Wehr'!L7+'Bankkonto-Jugendwehr'!L7+'Kasse-Jugendwehr'!L7+'Bankkonto-Musikzug'!L7+'Kasse-Musikzug'!L7+'Kasse 4'!L7+'Kasse 5'!L7","v":8000}]
[{"$f":"'Gesamt-Einnahmen und Ausgaben'!A8","v":3},{"$f":"'Gesamt-Einnahmen und Ausgaben'!B8","v":"Veräußerung von Vermögens-gegenständen im Einzelwert ab 500 € "},{"$f":"'Bankkonto-Wehr'!K8+'Kasse-Wehr'!K8+'Bankkonto-Jugendwehr'!K8+'Kasse-Jugendwehr'!K8+'Bankkonto-Musikzug'!K8+'Kasse-Musikzug'!K8+'Kasse 4'!K8+'Kasse 5'!K8","v":8000},{"$f":"'Gesamt-Einnahmen und Ausgaben'!D8","v":"Einnahmen aus Abgängen von der Bestandsliste"},{"$f":"'Gesamt-Einnahmen und Ausgaben'!E8","v":11},{"$f":"'Gesamt-Einnahmen und Ausgaben'!F8","v":"Erwerb von Vermögensgegenständen im Einzelwert ab 500 € "},{"$f":"'Bankkonto-Wehr'!L8+'Kasse-Wehr'!L8+'Bankkonto-Jugendwehr'!L8+'Kasse-Jugendwehr'!L8+'Bankkonto-Musikzug'!L8+'Kasse-Musikzug'!L8+'Kasse 4'!L8+'Kasse 5'!L8","v":8000},{"$f":"'Gesamt-Einnahmen und Ausgaben'!H8","v":"Ausgaben für Zugänge zur Bestandsliste"}]
[{"$f":"'Gesamt-Einnahmen und Ausgaben'!A9","v":4},{"$f":"'Gesamt-Einnahmen und Ausgaben'!B9","v":"Erstattung von Auslagen durch Gemeinde und Dritte"},{"$f":"'Bankkonto-Wehr'!K9+'Kasse-Wehr'!K9+'Bankkonto-Jugendwehr'!K9+'Kasse-Jugendwehr'!K9+'Bankkonto-Musikzug'!K9+'Kasse-Musikzug'!K9+'Kasse 4'!K9+'Kasse 5'!K9","v":8000},null,{"$f":"'Gesamt-Einnahmen und Ausgaben'!E9","v":12},{"$f":"'Gesamt-Einnahmen und Ausgaben'!F9","v":"Auslagen für Gemeinde und Dritte"},{"$f":"'Bankkonto-Wehr'!L9+'Kasse-Wehr'!L9+'Bankkonto-Jugendwehr'!L9+'Kasse-Jugendwehr'!L9+'Bankkonto-Musikzug'!L9+'Kasse-Musikzug'!L9+'Kasse 4'!L9+'Kasse 5'!L9","v":8000}]
[{"$f":"'Gesamt-Einnahmen und Ausgaben'!A10","v":5},{"$f":"'Gesamt-Einnahmen und Ausgaben'!B10","v":"Sonstige Einnahmen"},{"$f":"'Bankkonto-Wehr'!K10+'Kasse-Wehr'!K10+'Bankkonto-Jugendwehr'!K10+'Kasse-Jugendwehr'!K10+'Bankkonto-Musikzug'!K10+'Kasse-Musikzug'!K10+'Kasse 4'!K10+'Kasse 5'!K10","v":8000},null,{"$f":"'Gesamt-Einnahmen und Ausgaben'!E10","v":13},{"$f":"'Gesamt-Einnahmen und Ausgaben'!F10","v":"Sonstige Ausgaben"},{"$f":"'Bankkonto-Wehr'!L10+'Kasse-Wehr'!L10+'Bankkonto-Jugendwehr'!L10+'Kasse-Jugendwehr'!L10+'Bankkonto-Musikzug'!L10+'Kasse-Musikzug'!L10+'Kasse 4'!L10+'Kasse 5'!L10","v":8000}]
[{"$f":"'Gesamt-Einnahmen und Ausgaben'!A11","v":6},{"$f":"'Gesamt-Einnahmen und Ausgaben'!B11","v":"Einzahlungen der Gemeinde"},{"$f":"'Bankkonto-Wehr'!K11+'Kasse-Wehr'!K11+'Bankkonto-Jugendwehr'!K11+'Kasse-Jugendwehr'!K11+'Bankkonto-Musikzug'!K11+'Kasse-Musikzug'!K11+'Kasse 4'!K11+'Kasse 5'!K11","v":8000},null,{"$f":"'Gesamt-Einnahmen und Ausgaben'!E11","v":14},{"$f":"'Gesamt-Einnahmen und Ausgaben'!F11","v":"Auszahlungen an die Gemeinde"},{"$f":"'Bankkonto-Wehr'!L11+'Kasse-Wehr'!L11+'Bankkonto-Jugendwehr'!L11+'Kasse-Jugendwehr'!L11+'Bankkonto-Musikzug'!L11+'Kasse-Musikzug'!L11+'Kasse 4'!L11+'Kasse 5'!L11","v":8000}]
[{"$f":"'Gesamt-Einnahmen und Ausgaben'!A12","v":7},{"$f":"'Gesamt-Einnahmen und Ausgaben'!B12","v":"Entnahme aus der Rücklage"},{"$f":"IF(C52<0,C52*-1,0)","v":8000},{"$f":"'Gesamt-Einnahmen und Ausgaben'!D12","v":"Automatische Buchung"},{"$f":"'Gesamt-Einnahmen und Ausgaben'!E12","v":15},{"$f":"'Gesamt-Einnahmen und Ausgaben'!F12","v":"Zuführung zur Rücklage"},{"$f":"IF(C52>0,C52,0)","v":0},{"$f":"'Gesamt-Einnahmen und Ausgaben'!H12","v":"Automatische Buchung"}]
[{"$f":"'Gesamt-Einnahmen und Ausgaben'!A13","v":" 0-7"},{"$f":"'Gesamt-Einnahmen und Ausgaben'!B13","v":"Gesamteinnahmen"},{"$f":"SUM(C6:C13)","v":64000},null,{"$f":"'Gesamt-Einnahmen und Ausgaben'!E13","v":" 8-15"},{"$f":"'Gesamt-Einnahmen und Ausgaben'!F13","v":"Gesamtausgaben"},{"$f":"SUM(G6:G13)","v":64000}," "]
["© Ludwig Fink; Landesfeuerwehrverband Schleswig-Holstein",null,null,null,null,{"$f":"'Gesamt-Einnahmen und Ausgaben'!F14","v":"Die Ausgaben werden für gegenseitig deckungsfähig erklärt."}]
[]
[null,"Stand des Sondervermögens am 1.Januar 2020",10000,null,null,"Beschlossen auf der Hauptversammlung am:","Datum"]
[null,"Entnahme",{"$f":"C13","v":8000},null,null,"Unterschrift Wehrführer"]
[null,"Zuführung",{"$f":"G13","v":0},null,null,"----------------------------------------------------------------"]
[null,"Stand des Sondervermögens am 31.Dezember 2020",{"$f":"C17-C18+C19","v":2000}]
[]
[]
[]
[]
[]
[]
[]
[]
[]
[]
[]
[]
[]
[]
[]
[]
[]
[]
[]
[]
[]
[]
[]
[]
[]
[]
[]
[]
[]
[]
[null,"Rechenzellen:",{"$f":"SUM(C6:C12)","v":56000},{"$f":"SUM(G6:G12)","v":64000}]
[null,null,{"$f":"C51-D51","v":-8000}]
[]
[]
[]
[]
[]
[]
[]
[]
[]
[]
[]
[]
[]
[]
[]
[]
[]
[]
[]
[]
[]
[]
[]
[]
[]
[]
[]
[]
[]
[]
[]
[]
[]
[]
[]
[]
[]
[]
[]
[]
[]
[]
[]
[]
[]
[]
[]
[]
[]
[null,"Rechenzellen:"]
[null,"Rücklage",{"$f":"'Bankkonto-Wehr'!H10+'Kasse-Jugendwehr'!H10-'Bankkonto-Wehr'!D10-'Kasse-Jugendwehr'!D10","v":-2}]

{"sheet":"Gesamtrechnung (Plan-Ist)","index":12,"n_rows":21,"n_cols":12,"rows_kept":21,"cut":false,"hidden":false,"merged":[[0,0,0,6],[1,0,1,4]]}
[{"$f":"'Gesamt-Einnahmen und Ausgaben'!A1","v":"Sondervermögen Kameradschaftskasse der Freiwilligen Feuerwehr der Gemeinde Musterort"}]
["Einnahmen- und Ausgaben PLAN-IST-Vergleich für das Haushaltsjahr ",null,null,null,null,{"$f":"'Gesamt-Einnahmen und Ausgaben'!D2","v":2022}]
[null,"Gesamtplan"]
["Nr.","Bezeichnung","Einnahmen Plan ","Einnahmen Ist","Abweichung","Erläuterungen","Nr.","Bezeichnung","Ausgaben Plan ","Ausgaben Ist ","Abweichung","Erläuterungen"]
[1,2,3,4,5,6,7,8,9,10,11,12]
[{"$f":"'Gesamt-Einnahmen und Ausgaben'!A5","v":0},{"$f":"'Gesamt-Einnahmen und Ausgaben'!B5","v":"Zuwendungen von Mitgliedern"},{"$f":"'Gesamt-Planung'!C6","v":8000},{"$f":"'Gesamt-Einnahmen und Ausgaben'!C5","v":60016},{"$f":"D6-C6","v":52016},null,{"$f":"'Gesamt-Einnahmen und Ausgaben'!E5","v":8},{"$f":"'Gesamt-Einnahmen und Ausgaben'!F5","v":"Ausgaben für Kameradschaftspflege und Versammlungen"},{"$f":"'Gesamt-Planung'!G6","v":16000},{"$f":"'Gesamt-Einnahmen und Ausgaben'!G5","v":60121},{"$f":"J6-I6","v":44121}]
[{"$f":"'Gesamt-Einnahmen und Ausgaben'!A6","v":1},{"$f":"'Gesamt-Einnahmen und Ausgaben'!B6","v":"Zuwendungen von Dritten"},{"$f":"'Gesamt-Planung'!C7","v":8000},{"$f":"'Gesamt-Einnahmen und Ausgaben'!C6","v":60014},{"$f":"D7-C7","v":52014},null,{"$f":"'Gesamt-Einnahmen und Ausgaben'!E6","v":9},{"$f":"'Gesamt-Einnahmen und Ausgaben'!F6","v":"Ausgaben für Ehrungen, Geschenke und ähnliche Anlässe"},{"$f":"'Gesamt-Planung'!G7","v":8000},{"$f":"'Gesamt-Einnahmen und Ausgaben'!G6","v":60014},{"$f":"J7-I7","v":52014}]
[{"$f":"'Gesamt-Einnahmen und Ausgaben'!A7","v":2},{"$f":"'Gesamt-Einnahmen und Ausgaben'!B7","v":"Einnahmen aus Veranstaltungen "},{"$f":"'Gesamt-Planung'!C8","v":8000},{"$f":"'Gesamt-Einnahmen und Ausgaben'!C7","v":60014},52014,null,{"$f":"'Gesamt-Einnahmen und Ausgaben'!E7","v":10},{"$f":"'Gesamt-Einnahmen und Ausgaben'!F7","v":"Ausgaben für Veranstaltungen "},{"$f":"'Gesamt-Planung'!G8","v":8000},{"$f":"'Gesamt-Einnahmen und Ausgaben'!G7","v":60007},52007]
[{"$f":"'Gesamt-Einnahmen und Ausgaben'!A8","v":3},{"$f":"'Gesamt-Einnahmen und Ausgaben'!B8","v":"Veräußerung von Vermögens-gegenständen im Einzelwert ab 500 € "},{"$f":"'Gesamt-Planung'!C9","v":8000},{"$f":"'Gesamt-Einnahmen und Ausgaben'!C8","v":60014},52014,"Einnahmen für Abgänge aus der Bestandsliste",{"$f":"'Gesamt-Einnahmen und Ausgaben'!E8","v":11},{"$f":"'Gesamt-Einnahmen und Ausgaben'!F8","v":"Erwerb von Vermögensgegenständen im Einzelwert ab 500 € "},{"$f":"'Gesamt-Planung'!G9","v":8000},{"$f":"'Gesamt-Einnahmen und Ausgaben'!G8","v":60007},52007,{"$f":"'Gesamt-Einnahmen und Ausgaben'!H8","v":"Ausgaben für Zugänge zur Bestandsliste"}]
[{"$f":"'Gesamt-Einnahmen und Ausgaben'!A9","v":4},{"$f":"'Gesamt-Einnahmen und Ausgaben'!B9","v":"Erstattung von Auslagen durch Gemeinde und Dritte"},{"$f":"'Gesamt-Planung'!C10","v":8000},{"$f":"'Gesamt-Einnahmen und Ausgaben'!C9","v":60014},52014,null,{"$f":"'Gesamt-Einnahmen und Ausgaben'!E9","v":12},{"$f":"'Gesamt-Einnahmen und Ausgaben'!F9","v":"Auslagen für Gemeinde und Dritte"},{"$f":"'Gesamt-Planung'!G10","v":8000},{"$f":"'Gesamt-Einnahmen und Ausgaben'!G9","v":60007},52007]
[{"$f":"'Gesamt-Einnahmen und Ausgaben'!A10","v":5},{"$f":"'Gesamt-Einnahmen und Ausgaben'!B10","v":"Sonstige Einnahmen"},{"$f":"'Gesamt-Planung'!C11","v":8000},{"$f":"'Gesamt-Einnahmen und Ausgaben'!C10","v":60014},52014,null,{"$f":"'Gesamt-Einnahmen und Ausgaben'!E10","v":13},{"$f":"'Gesamt-Einnahmen und Ausgaben'!F10","v":"Sonstige Ausgaben"},{"$f":"'Gesamt-Planung'!G11","v":8000},{"$f":"'Gesamt-Einnahmen und Ausgaben'!G10","v":60007},52007]
[{"$f":"'Gesamt-Einnahmen und Ausgaben'!A11","v":6},{"$f":"'Gesamt-Einnahmen und Ausgaben'!B11","v":"Einzahlungen der Gemeinde"},{"$f":"'Gesamt-Planung'!C12","v":8000},{"$f":"'Gesamt-Einnahmen und Ausgaben'!C11","v":60014},52014,null,{"$f":"'Gesamt-Einnahmen und Ausgaben'!E11","v":14},{"$f":"'Gesamt-Einnahmen und Ausgaben'!F11","v":"Auszahlungen an die Gemeinde"},{"$f":"'Gesamt-Planung'!G12","v":8000},{"$f":"'Gesamt-Einnahmen und Ausgaben'!G11","v":60007},52007]
[{"$f":"'Gesamt-Einnahmen und Ausgaben'!A12","v":7},{"$f":"'Gesamt-Einnahmen und Ausgaben'!B12","v":"Entnahme aus der Rücklage"},{"$f":"'Gesamt-Planung'!C13","v":8000},{"$f":"'Gesamt-Einnahmen und Ausgaben'!C12","v":70},-7930,"Automatische Buchung",{"$f":"'Gesamt-Einnahmen und Ausgaben'!E12","v":15},{"$f":"'Gesamt-Einnahmen und Ausgaben'!F12","v":"Zuführung zur Rücklage"},{"$f":"'Gesamt-Planung'!G13","v":0},{"$f":"'Gesamt-Einnahmen und Ausgaben'!G12","v":0},0,"Automatische Buchung"]
[{"$f":"'Gesamt-Einnahmen und Ausgaben'!A13","v":" 0-7"},{"$f":"'Gesamt-Einnahmen und Ausgaben'!B13","v":"Gesamteinnahmen"},{"$f":"SUM(C6:C13)","v":64000},{"$f":"SUM(D6:D13)","v":420170},356170,null,{"$f":"'Gesamt-Einnahmen und Ausgaben'!E13","v":" 8-15"},{"$f":"'Gesamt-Einnahmen und Ausgaben'!F13","v":"Gesamtausgaben"},{"$f":"SUM(I6:I13)","v":64000},{"$f":"SUM(J6:J13)","v":420170},356170," "]
["© Ludwig Fink; Landesfeuerwehrverband Schleswig-Holstein"]
[]
[null,"Entwicklung des Sondervermögens","Plan","Ist","Abweichung"]
[null,{"$f":"'Gesamt-Planung'!B17","v":"Stand des Sondervermögens am 1.Januar 2020"},{"$f":"'Gesamt-Planung'!C17","v":10000},{"$f":"'Gesamt-Einnahmen und Ausgaben'!C15","v":307},{"$f":"D18-C18","v":-9693}]
[null,"Entnahme",{"$f":"'Gesamt-Planung'!C18","v":8000},{"$f":"'Gesamt-Einnahmen und Ausgaben'!C16","v":70},{"$f":"D19-C19","v":-7930}]
[null,"Zuführung",{"$f":"'Gesamt-Planung'!C19","v":0},{"$f":"'Gesamt-Einnahmen und Ausgaben'!C17","v":0},0]
[null,{"$f":"'Gesamt-Planung'!B20","v":"Stand des Sondervermögens am 31.Dezember 2020"},{"$f":"'Gesamt-Planung'!C20","v":2000},{"$f":"'Gesamt-Einnahmen und Ausgaben'!C18","v":237},-1763]

{"sheet":"Bestandsverzeichnis","index":13,"n_rows":40,"n_cols":4,"rows_kept":40,"cut":false,"hidden":false,"merged":[]}
[{"$f":"'Gesamt-Einnahmen und Ausgaben'!A1","v":"Sondervermögen Kameradschaftskasse der Freiwilligen Feuerwehr der Gemeinde Musterort"}]
["Bestandsverzeichnis für Vermögensgegenstände mit Anschaffungs-/Herstellungskosten "]
["im Einzelwert ab 500,00 €"]
["© Ludwig Fink; Landesfeuerwehrverband Schleswig-Holstein"]
["Inventar-Nr.","Bezeichnung","Datum ","Historische AK/HK"]
["001","Beispiel","2017-06-22",599.66999999999996]
["002"]
["003"]
["004"]
["005"]
["006"]
["007"]
["008"]
["009"]
["010"]
["011"]
["012"]
["013"]
["014"]
["015"]
["016"]
["017"]
["018"]
["019"]
["020"]
["021"]
["022"]
["023"]
["024"]
["025"]
["026"]
["027"]
["028"]
["029"]
["030"]
["031"]
["032"]
["033"]
["034"]
["035"]

{"sheet":"Checkliste Kassenprüfung","index":14,"n_rows":24,"n_cols":2,"rows_kept":24,"cut":false,"hidden":false,"merged":[]}
[null,"Checkliste Kassenprüfung"]
["A","Allgemeine Grundsätze"]
[1,"Keine Buchung ohne Beleg"]
[2,"Die Belege werden je Kasse fortlaufend mit Nummern markiert und gebucht, es gibt keine Lücken"]
[3,"Markierungen, Nummern, Unterschriften etc. sind mit dokumentenechten Schreibern durchzuführen"]
[4,"Vier-Augen-Prinzip muss eingehalten werden, Anweisender und Kassenwartung unterschreiben"]
[5,"Jede Ausgabe ist auf sachlich richtige Zuordnung nach den Ziffern des Programms zu prüfen. Sind sie dem Träger der Feuerwehr zuzuordnen, ist eine Erstattung zu veranlassen"]
["B","Prüfung der Bankkonten"]
[6,"Für alle Konten gibt es lückenlos Kontoauszüge"]
[7,"Saldenmitteilungen zum 31.12. stimmen mit den Eintragungen im Kassenprogramm zum 31.12. überein."]
["C","Prüfung der Bar-Kassen"]
[8,"Für alle Kassen gibt es ein chronologisch geführtes Kassenbuch."]
[9,"Zum 31.12. wurde eine Kassenzählung mit Kassenaufnahmeprotokoll angefertigt und von der Kassenwartung unterschrieben."]
["D","Prüfung des Kassenprogramms"]
[10,"Die Anfangsstände zum 1.1. sind korrekt vom Endstand des Kassenprogramms zum 31.12. des Vorjahres übernommen worden"]
[11,"Die errechneten Endstände im Kassenprogramm zum 31.12. stimmen mit den Kontoauszügen, Saldenmitteilungen und Aufnahmeprotokollen überein."]
["E","Prüfung der Buchführung"]
[12,"Jeder Beleg wurde separat gebucht"]
[13,"Jeder Beleg trägt zwei dokumentenechte Unterschriften, eine zur Anweisung, die zweite vom Kassenwart als Zahlungsvermerk"]
[14,"Jeder Beleg trägt das Datum der Zahlung"]
[15,"Die Belege (je Kasse) wurden fortlaufend mit Nummern markiert und gebucht, es gibt keine Lücken"]
[16,"Es gibt keine Hinweise darauf, dass die Kasse/Buchführung nicht zeitnah bearbeitet wurde."]
[null,"© Ludwig Fink; Landesfeuerwehrverband Schleswig-Holstein"]
[null,"Die Checkliste erhebt keinen Anspruch auf Vollständigkeit, sondern wird als Grundgerüst zur Kassenprüfung empfohlen."]